{"text_format":"1","workbook":"xlsx","n_sheets":9,"sheets":["# Onderlinge","Uitslag","Personele prijzen","Ons Genoegen","Buitenlust","Roos in Bloei","Heidebloem","Heideroosje","18m schutters"],"not_rendered":{"charts":0,"images":5,"macros":1,"external_links":0,"defined_names":7,"comments":0,"pivot_tables":0},"unopened":[],"bounds":{"document_bytes":16777216,"sheet_cells":100000,"rows_first":2000,"rows_last":500,"rows_between":2000,"halvings":0,"cell_chars":16384,"cell_head_chars":4096},"cells_cut":0,"cells_raw":0,"read":"whole","date_system":"1900"}

{"sheet":"# Onderlinge","index":0,"n_rows":62,"n_cols":14,"rows_kept":62,"cut":false,"hidden":false,"merged":[[31,4,31,5],[32,4,32,5],[38,4,38,5],[32,0,32,1],[34,0,34,1],[35,0,35,1],[36,0,36,1],[33,0,33,1],[33,4,33,5],[34,4,34,5],[0,1,0,3],[1,1,1,3],[1,4,1,5],[0,4,0,5],[37,4,37,5],[16,1,16,8],[15,1,15,8],[25,0,25,1],[26,0,26,1],[27,0,27,1],[28,0,28,1],[29,0,29,1],[25,4,25,5],[26,4,26,5],[27,4,27,5],[28,4,28,5]]}
["INVULLEN","Nummer Onderlingen",null,null,1,null,null,null,"Beginjaar",2016,null,"Actueel Jaar",2016,"Deze regels worden niet mee uitgeprint"]
["!!!!!!","Organiserende vereniging",null,null,"De Heidebloem",null,null,null,"Eindjaar",{"$f":"J1+1","v":2017},null,null,null,"OPSLAAN ALS EXCEL WERKBLAD MET MACRO'S!!!!!"]
[null,"Onderaan naam zestalcommissie lid invullen!!!"]
[]
[null,null,null,null,{"$f":"CONCATENATE(\"Roggelse doelen seizoen \",J1, \" - \",J2,)","v":"Roggelse doelen seizoen 2016 - 2017"}]
[null,null,null,null,{"$f":"CONCATENATE(E1, \"e Onderlinge Bekerwedstrijd \",E2)","v":"1e Onderlinge Bekerwedstrijd De Heidebloem"}]
[]
[]
[]
[]
[]
[]
[]
[]
[]
[null,{"$f":"CONCATENATE(A26,\" winnaar van deze ronde met \",C26,\" punten\")","v":"Ons Genoegen 1 winnaar van deze ronde met 1399 punten"}]
[null,{"$f":"CONCATENATE(Uitslag!B4, \" hoogste schutter met \", Uitslag!D4, \" punten\")","v":"Steve Wijler hoogste schutter met 244 punten"}]
[]
[{"$f":"CONCATENATE(\"Op de banen van \",E2, \" werd afgelopen weekend de \",E1,\"e ronde van de Onderlinge\")","v":"Op de banen van De Heidebloem werd afgelopen weekend de 1e ronde van de Onderlinge"}]
[{"$f":"CONCATENATE(\"Bekerwedstrijd georganiseerd. Deze wedstrijd werd goed bezocht, er waren \", COUNTIF(Uitslag!E4:E129, \">0\") + COUNTIF('18m schutters'!D4:D18, \">0\"),\" deelnemers.\")","v":"Bekerwedstrijd georganiseerd. Deze wedstrijd werd goed bezocht, er waren 93 deelnemers."}]
[{"$f":"CONCATENATE(\"De overwinning werd behaald door \", A26, \". De hoogste schutter werd\")","v":"De overwinning werd behaald door Ons Genoegen 1. De hoogste schutter werd"}]
[{"$f":"CONCATENATE(\"door \",VLOOKUP(Uitslag!Q4,'# Onderlinge'!A58:C62,2),\" geleverd: \",Uitslag!B4,\" behaalde \", Uitslag!D4, \" punten.\")","v":"door Ons Genoegen geleverd: Steve Wijler behaalde 244 punten."}]
[]
["Uitslagen "]
["1e Zestallen",null,null,null,"3e Zestallen"]
[{"$f":"Uitslag!X4","v":"Ons Genoegen 1"},null,{"$f":"Uitslag!Y4","v":1399},null,{"$f":"Uitslag!X19","v":"Heideroosje 3"},null,{"$f":"Uitslag!Y19","v":1222}]
[{"$f":"Uitslag!X5","v":"Heideroosje 1"},null,{"$f":"Uitslag!Y5","v":1342},null,{"$f":"Uitslag!X20","v":"Ons Genoegen 3"},null,{"$f":"Uitslag!Y20","v":1191}]
[{"$f":"Uitslag!X6","v":"Heidebloem 1"},null,{"$f":"Uitslag!Y6","v":1288},null,{"$f":"Uitslag!X21","v":"Heidebloem 3"},null,{"$f":"Uitslag!Y21","v":848}]
[{"$f":"Uitslag!X7","v":"Roos in Bloei 1"},null,{"$f":"Uitslag!Y7","v":1274},null,{"$f":"Uitslag!X22","v":"Roos in Bloei 3"},null,{"$f":"Uitslag!Y22","v":174}]
[{"$f":"Uitslag!X8","v":"Buitenlust 1"},null,{"$f":"Uitslag!Y8","v":1176}]
[null,null,null,null,"4e Zestallen"]
["2e Zestallen",null,null,null,{"$f":"Uitslag!X26","v":"Heideroosje 4"},null,{"$f":"Uitslag!Y26","v":1161}]
[{"$f":"Uitslag!X12","v":"Ons Genoegen 2"},null,{"$f":"Uitslag!Y12","v":1302},null,{"$f":"Uitslag!X27","v":"Ons Genoegen 4"},null,{"$f":"Uitslag!Y27","v":318}]
[{"$f":"Uitslag!X13","v":"Heideroosje 2"},null,{"$f":"Uitslag!Y13","v":1285}]
[{"$f":"Uitslag!X14","v":"Heidebloem 2"},null,{"$f":"Uitslag!Y14","v":1201}]
[{"$f":"Uitslag!X15","v":"Roos in Bloei 2"},null,{"$f":"Uitslag!Y15","v":1142}]
[{"$f":"Uitslag!X16","v":"Buitenlust 2"},null,{"$f":"Uitslag!Y16","v":191},null,"5e/6e/7e Zestallen"]
[null,null,null,null,{"$f":"Uitslag!X33","v":"Heideroosje 5"},null,{"$f":"Uitslag!Y33","v":942}]
[null,null,null,null,{"$f":"Uitslag!X34","v":"Heideroosje 6"},null,{"$f":"Uitslag!Y34","v":246}]
[]
["Hoogste Heer",null,null,{"$f":"INDEX(Uitslag!$B$4:$B$129, MATCH(1, Uitslag!$C$4:$C$129, 0))","v":"Steve Wijler"},null,null,{"$f":"INDEX(Uitslag!$D$4:$D$129, MATCH(1, Uitslag!$C$4:$C$129, 0))","v":244},"Punten",{"$f":"VLOOKUP(INDEX(Uitslag!$Q$4:$Q$129, MATCH(1, Uitslag!$C$4:$C$129, 0)), $A$58:$B$62, 2)","v":"Ons Genoegen"}]
["Hoogste Dame",null,null,{"$f":"INDEX(Uitslag!$B$4:$B$129, MATCH(2, Uitslag!$C$4:$C$129, 0))","v":"Sabine van Rijt"},null,null,{"$f":"INDEX(Uitslag!$D$4:$D$129, MATCH(2, Uitslag!$C$4:$C$129, 0))","v":227},"Punten",{"$f":"VLOOKUP(INDEX(Uitslag!$Q$4:$Q$129, MATCH(2, Uitslag!$C$4:$C$129, 0)), $A$58:$B$62, 2)","v":"Heidebloem"}]
["Hoogste Veteraan",null,null,{"$f":"INDEX(Uitslag!$B$4:$B$129, MATCH(3, Uitslag!$C$4:$C$129, 0))","v":"Peter Verstappen"},null,null,{"$f":"INDEX(Uitslag!$D$4:$D$129, MATCH(3, Uitslag!$C$4:$C$129, 0))","v":223},"Punten",{"$f":"VLOOKUP(INDEX(Uitslag!$Q$4:$Q$129, MATCH(3, Uitslag!$C$4:$C$129, 0)), $A$58:$B$62, 2)","v":"Heideroosje"}]
["Hoogste Jeugd (t/m 18 jaar):",null,null,{"$f":"INDEX(Uitslag!$B$4:$B$129, MATCH(4, Uitslag!$C$4:$C$129, 0))","v":"Jasper Stokmans"},null,null,{"$f":"INDEX(Uitslag!$D$4:$D$129, MATCH(4, Uitslag!$C$4:$C$129, 0))","v":213},"Punten",{"$f":"VLOOKUP(INDEX(Uitslag!$Q$4:$Q$129, MATCH(4, Uitslag!$C$4:$C$129, 0)), $A$58:$B$62, 2)","v":"Ons Genoegen"}]
["Hoogste Jeugd (t/m 15 jaar):",null,null,{"$f":"INDEX(Uitslag!$B$4:$B$129, MATCH(5, Uitslag!$C$4:$C$129, 0))","v":"Mike Sijbers"},null,null,{"$f":"INDEX(Uitslag!$D$4:$D$129, MATCH(5, Uitslag!$C$4:$C$129, 0))","v":208},"Punten",{"$f":"VLOOKUP(INDEX(Uitslag!$Q$4:$Q$129, MATCH(5, Uitslag!$C$4:$C$129, 0)), $A$58:$B$62, 2)","v":"Heideroosje"}]
["Hoogste Jeugd 18m",null,null,{"$f":"'18m schutters'!B4","v":"Loek Hendriks"},null,null,{"$f":"'18m schutters'!D4","v":177},"Punten",{"$f":"VLOOKUP('18m schutters'!Q4, $A$58:$B$62, 2)","v":"Roos in Bloei"}]
[]
["Wij kijken terug op een gezellig en sportief schietweekend!"]
["Graag tot ziens op de volgende bekerwedstrijd bij Ons Genoegen. "]
[]
[{"$f":"CONCATENATE(\"Namens de zestalcommissie \",E2,)","v":"Namens de zestalcommissie De Heidebloem"}]
[]
[]
[]
[]
[]
[]
[1,"Ons Genoegen"]
[2,"Buitenlust"]
[3,"Roos in Bloei"]
[4,"Heidebloem"]
[5,"Heideroosje"]

{"sheet":"Uitslag","index":1,"n_rows":129,"n_cols":25,"rows_kept":129,"cut":false,"hidden":false,"merged":[[1,4,1,9],[1,10,1,14]]}
[null,"Uitslag Persoonlijk",null,null,null,null,null,null,null,null,null,null,null,null,null,null,null,null,null,null,null,null,null,"Uitslag Zestallen"]
[null,null,null,null,"Hoogste serie",null,null,null,null,null,"Laatste pijlen*"]
["Positie","Naam","Klasse","Punten","1","2","3","4","5","Totaal","21","22","23","24","25","Totaal2","Club",null,null,"Klasse",null,null,null,"1e Zestallen","Punten"]
[1,"Steve Wijler",1,244,9,10,10,10,10,49,9,10,10,10,10,49,1,null,null,1,"Heren",null,null,"Ons Genoegen 1",{"$f":"'Ons Genoegen'!U20","v":1399}]
[2,"Frank Hoogmans",1,239,9,10,10,10,10,49,10,9,9,10,10,48,1,null,null,2,"Dames",null,null,"Heideroosje 1",{"$f":"Heideroosje!U20","v":1342}]
[3,"Edwin Joosten",1,233,10,10,10,10,10,50,10,9,8,9,9,45,5,null,null,3,"Veteraan",null,null,"Heidebloem 1",{"$f":"Heidebloem!U20","v":1288}]
[4,"Rik van den Beuken",1,233,9,10,10,10,10,49,10,9,8,9,9,45,1,null,null,4,"Jeugd t/m 18",null,null,"Roos in Bloei 1",{"$f":"'Roos in Bloei'!U20","v":1274}]
[5,"Ben Koper",1,229,9,10,9,9,10,47,9,10,9,9,10,47,5,null,null,5,"Jeugd t/m 15",null,null,"Buitenlust 1",{"$f":"Buitenlust!U20","v":1176}]
[6,"Henk Smolenaars",1,228,10,9,9,10,9,47,8,8,10,9,10,45,1,null,null,6,"Jeugd t/m 13"]
[7,"Kevin Slaats",1,228,10,10,9,9,10,48,9,9,10,8,10,46,1]
[8,"Sabine van Rijt",2,227,9,10,10,10,9,48,9,10,10,10,9,48,4,null,null,null,null,null,null,"2e Zestallen","Punten"]
[9,"Huib Salimans",1,227,9,9,10,9,10,47,9,9,10,10,9,47,1,null,null,null,null,null,null,"Ons Genoegen 2",{"$f":"'Ons Genoegen'!U21","v":1302}]
[10,"Peter Verstappen",3,223,9,9,10,10,9,47,9,10,9,9,8,45,5,null,null,null,null,null,null,"Heideroosje 2",{"$f":"Heideroosje!U21","v":1285}]
[11,"Jo Peeters",3,222,9,10,10,10,9,48,9,8,10,10,10,47,5,null,null,null,null,null,null,"Heidebloem 2",{"$f":"Heidebloem!U21","v":1201}]
[12,"Jac Gielen",1,222,8,9,9,10,10,46,10,6,9,9,10,44,2,null,null,null,null,null,null,"Roos in Bloei 2",{"$f":"'Roos in Bloei'!U21","v":1142}]
[13,"Leo Pijls",1,222,9,8,9,10,9,45,9,8,8,9,9,43,1,null,null,null,null,null,null,"Buitenlust 2",{"$f":"Buitenlust!U21","v":191}]
[14,"Jeroen Verschuren",1,222,10,10,10,9,8,47,10,10,10,9,8,47,3]
[15,"Theo Pijls",3,220,10,8,9,10,10,47,10,8,9,10,10,47,1,null,null,null,null,null,null,"3e Zestallen","Punten"]
[16,"Har Luijten",3,218,10,9,9,9,10,47,10,9,9,9,10,47,2,null,null,null,null,null,null,"Heideroosje 3",{"$f":"Heideroosje!U22","v":1222}]
[17,"Jan Sijbers",1,218,8,8,9,10,10,45,10,10,6,9,10,45,3,null,null,null,null,null,null,"Ons Genoegen 3",{"$f":"'Ons Genoegen'!U22","v":1191}]
[18,"Maikel Boumans",1,218,9,8,9,10,10,46,9,9,10,9,9,46,5,null,null,null,null,null,null,"Heidebloem 3",{"$f":"Heidebloem!U22","v":848}]
[19,"Lowie Joosten",3,218,10,8,8,9,10,45,10,8,8,10,8,44,4,null,null,null,null,null,null,"Roos in Bloei 3",{"$f":"'Roos in Bloei'!U22","v":174}]
[20,"Lau Geraets",1,217,10,9,9,9,9,46,9,9,8,8,10,44,1,null,null,null,null,null,null,"Buitenlust 3",{"$f":"Buitenlust!U22","v":0}]
[21,"Marc Simons",1,217,9,8,9,10,9,45,9,8,9,10,9,45,5]
[22,"Etienne Deckers",1,217,8,9,10,10,10,47,9,9,9,8,8,43,3,null,null,null,null,null,null,"4e Zestallen","Punten"]
[23,"Jos Bongers",1,216,8,10,9,10,10,47,8,10,9,10,10,47,1,null,null,null,null,null,null,"Heideroosje 4",{"$f":"Heideroosje!U23","v":1161}]
[24,"Math Crins",1,216,10,10,10,8,8,46,9,9,9,9,8,44,5,null,null,null,null,null,null,"Ons Genoegen 4",{"$f":"'Ons Genoegen'!U23","v":318}]
[25,"Marcel Walschot",1,215,10,9,9,9,9,46,8,8,8,7,10,41,5,null,null,null,null,null,null,"Heidebloem 4",{"$f":"Heidebloem!U23","v":0}]
[26,"Gerard v/d Beuken",1,215,10,8,9,9,10,46,9,10,8,7,9,43,2,null,null,null,null,null,null,"Roos in Bloei 4",{"$f":"'Roos in Bloei'!U23","v":0}]
[27,"Cor Joosten",1,215,10,8,10,9,10,47,6,8,8,10,8,40,5,null,null,null,null,null,null,"Buitenlust 4",{"$f":"Buitenlust!U23","v":0}]
[28,"Michael Simons",1,215,10,10,8,10,6,44,10,9,9,6,8,42,5]
[29,"Rob Schaareman",1,214,10,7,9,10,9,45,10,7,9,10,9,45,1,null,null,null,null,null,null,"5e / 6e Zestallen","Punten"]
[30,"Jasper Stokmans",4,213,10,9,9,9,8,45,9,8,10,8,8,43,1,null,null,null,null,null,null,"Heideroosje 5",{"$f":"Heideroosje!U24","v":942}]
[31,"Piet van Roy",3,213,7,10,10,9,8,44,9,10,6,10,7,42,4,null,null,null,null,null,null,"Heideroosje 6",{"$f":"Heideroosje!U25","v":246}]
[32,"Huub Sijbers",1,212,10,9,9,7,9,44,10,9,9,7,9,44,5,null,null,null,null,null,null,"Heideroosje 7",{"$f":"Heideroosje!U26","v":0}]
[33,"Jan Derks",3,212,10,9,10,9,8,46,10,9,10,9,8,46,5,null,null,null,null,null,null,"Heideroosje 8",{"$f":"Heideroosje!U27","v":0}]
[34,"Peter Mennen",1,211,9,8,9,9,9,44,10,7,10,8,7,42,3,null,null,null,null,null,null,"Ons Genoegen 5",{"$f":"'Ons Genoegen'!U24","v":0}]
[35,"Peter Joosten",3,210,9,9,10,7,10,45,9,9,10,7,10,45,4,null,null,null,null,null,null,"Buitenlust 5",{"$f":"Buitenlust!U24","v":0}]
[36,"Wiel Boonen",3,210,10,9,8,9,10,46,10,7,6,7,9,39,4,null,null,null,null,null,null,"Roos in Bloei 5",{"$f":"'Roos in Bloei'!U24","v":0}]
[37,"Wim Verstappen",1,210,10,9,9,9,9,46,9,8,9,9,6,41,4,null,null,null,null,null,null,"Heidebloem 5",{"$f":"Heidebloem!U24","v":0}]
[38,"René Ververs",1,209,10,9,10,8,9,46,8,9,8,7,6,38,1,null,null,null,null,null,null,"Heideroosje 9",{"$f":"Heideroosje!U28","v":0}]
[39,"Johan van Rijt",1,208,10,10,8,9,9,46,8,7,9,9,9,42,4,null,null,null,null,null,null,"Heideroosje 10",{"$f":"Heideroosje!U29","v":0}]
[40,"Marc Schaareman",1,208,9,8,10,9,8,44,8,8,7,9,9,41,1]
[41,"Mike Sijbers",5,208,10,8,7,10,9,44,9,1,6,10,7,33,5]
[42,"Olga Sijbers",5,208,10,9,9,8,8,44,7,10,7,8,7,39,5]
[43,"Nard Roost",1,205,10,9,7,10,9,45,8,7,7,8,9,39,4]
[44,"Ad Goossens",3,204,9,9,10,10,10,48,9,9,10,10,10,48,4]
[45,"Thieu Jeurninck",3,204,10,8,9,7,8,42,7,8,9,8,9,41,3]
[46,"Harold Janshen",1,204,8,10,7,10,9,44,7,9,8,8,8,40,1]
[47,"Quin Hendriks",5,202,8,10,8,10,8,44,8,9,9,null,10,36,3]
[48,"Ria Walschot",2,202,7,7,9,10,8,41,7,8,9,8,9,41,5]
[49,"Wim Janssen",3,202,9,9,10,8,8,44,10,6,10,10,7,43,5]
[50,"Fred Janssen",1,202,8,7,10,9,10,44,10,7,6,7,3,33,5]
[51,"Rymon van Horne",1,201,9,10,8,10,6,43,9,10,8,10,6,43,4]
[52,"Brianne Ghielen",5,200,10,9,9,9,9,46,7,6,7,8,5,33,5]
[53,"Lowie Claessen",3,199,7,8,8,9,10,42,9,8,7,8,8,40,4]
[54,"Hans Sijbers",1,198,8,9,6,10,9,42,8,9,6,10,9,42,5]
[55,"Jan Ottenheim",3,196,10,7,8,10,8,43,5,8,8,4,8,33,5]
[56,"Jeroen van Nispen",5,195,8,9,8,10,9,44,8,8,7,9,10,42,3]
[57,"Koos Heijnen",1,195,10,9,7,7,10,43,6,6,9,null,9,30,1]
[58,"Maurice Linders",1,195,7,10,8,8,9,42,9,8,6,9,8,40,5]
[59,"Pascal Hendriks",1,194,9,8,10,10,10,47,8,null,9,9,8,34,3]
[60,"Sjeng Boonen",1,193,8,7,8,9,9,41,8,7,8,9,9,41,3]
[61,"Petra Joosten",2,192,7,10,9,9,8,43,7,8,8,9,9,41,5]
[62,"Huub Korsten",1,192,9,9,10,7,10,45,9,9,7,7,9,41,5]
[63,"Douwe Grenzenberg",1,192,9,7,9,9,8,42,8,6,8,8,5,35,3]
[64,"Wesley Hendriks",1,190,10,8,8,9,7,42,9,7,9,10,6,41,3]
[65,"Jo Caalders",3,189,9,10,6,10,8,43,5,6,10,9,9,39,2]
[66,"Ben Geraets",4,188,9,7,9,9,9,43,9,7,9,9,9,43,1]
[67,"Harry Moonen",1,188,9,9,8,7,7,40,9,8,8,7,7,39,5]
[68,"Amber Lammers",2,187,9,9,7,10,9,44,7,5,7,6,9,34,1]
[69,"Jo van Rijt",3,184,9,9,10,9,10,47,9,9,10,9,10,47,4]
[70,"Diana Sijbers",2,180,6,7,9,8,9,39,5,8,8,9,7,37,5]
[71,"Martin Damen",1,178,8,9,8,8,8,41,8,8,7,3,10,36,2]
[72,"Wim Hendriks",1,178,7,8,8,10,9,42,2,7,8,7,6,30,3]
[73,"Frits Levels",3,175,8,5,9,8,10,40,7,8,9,7,6,37,4]
[74,"Piet Gommans",3,174,10,6,8,8,6,38,9,8,5,6,8,36,3]
[75,"Fried Fijten",3,173,4,8,7,8,10,37,4,8,7,8,10,37,5]
[76,"Elliy Glim",3,172,10,8,6,9,6,39,5,7,9,7,8,36,4]
[77,"Rien van Hugten",1,170,10,7,6,8,9,40,5,8,6,6,5,30,4]
[78,"Nard Peeters",1,169,8,7,6,7,9,37,7,5,8,4,8,32,4]
[79,"Willem-Jan Timmermans",1,163,5,8,8,7,10,38,5,8,8,7,10,38,1]
[80,"Peter van Ratingen",1,162,7,9,null,9,8,33,9,9,null,8,5,31,4]
[81,"Carolien van Dijk",2,156,7,9,6,8,6,36,8,5,4,5,9,31,5]
[82,"Jose Korsten",2,156,7,7,6,10,8,38,7,7,8,5,5,32,5]
[83,"Nikki Wetjens",2,155,8,8,7,10,5,38,8,6,4,5,7,30,1]
[84,"Mike Dekker",1,154,9,8,7,8,8,40,8,8,6,7,5,34,2]
[85,"Thei Peeters",3,142,7,9,8,8,8,40,7,9,8,8,8,40,5]
[86,"Myrthe Das",5,135,8,7,7,7,6,35,7,5,6,5,8,31,5]
[87,"Fabienne v/d Dungen",5,131,9,9,7,5,7,37,5,5,4,3,9,26,5]
[88,"Mike Koper",1,115,4,7,7,5,4,27,4,7,7,5,4,27,5]
[89,"Paulien v/d Beuken",2,98,4,6,7,7,4,28,4,9,2,6,1,22,2]
[90,"Wim Peeters",1,93,1,5,6,5,6,23,1,5,6,5,6,23,2]
[91,"Wil Luijten",1,null,null,null,null,null,null,0,null,null,null,null,null,0,2]
[92,"Desiréé Lommen",2,null,null,null,null,null,null,0,null,null,null,null,null,0,4]
[93,"Ger Levels",1,null,null,null,null,null,null,0,null,null,null,null,null,0,4]
[94,"Theij Verdonschot",3,null,null,null,null,null,null,0,null,null,null,null,null,0,4]
[95,"Rian Jeurninck",2,null,null,null,null,null,null,0,null,null,null,null,null,0,5]
[96,"Stephan Ghielen",4,null,null,null,null,null,null,0,null,null,null,null,null,0,5]
[97,"Silfran Ghielen",1,null,null,null,null,null,null,0,null,null,null,null,null,0,5]
[98,"Aron Smolenaars",4,null,null,null,null,null,null,0,null,null,null,null,null,0,1]
[99,"Danielle Heijnen",2,null,null,null,null,null,null,0,null,null,null,null,null,0,1]
[100,"Mark Vossen",5,null,null,null,null,null,null,0,null,null,null,null,null,0,1]
[101,"Martijn Janssen",1,null,null,null,null,null,null,0,null,null,null,null,null,0,3]
[102,"Sjaak Clephas",3,null,null,null,null,null,null,0,null,null,null,null,null,0,3]
[103,"Rob van Nispen",4,null,null,null,null,null,null,0,null,null,null,null,null,0,3]
[104]
[105]
[106]
[107]
[108]
[109]
[110]
[111]
[112]
[113]
[114]
[115]
[116]
[117]
[118]
[119]
[120]
[121]
[122]
[123]
[124]
[125]
[126]

{"sheet":"Personele prijzen","index":2,"n_rows":140,"n_cols":11,"rows_kept":140,"cut":false,"hidden":false,"merged":[]}
["Persoonlijke Uitslag"]
[]
["Groep A - 250 t/m 213 punten"]
[null,null,null,null,"Hoogste serie"]
["Positie","Naam","Klasse","Punten","1","2","3","4","5","Totaal","Totaal2"]
[3,"Edwin Joosten",1,233,10,10,10,10,10,50,45]
[1,"Steve Wijler",1,244,9,10,10,10,10,49,49]
[2,"Frank Hoogmans",1,239,9,10,10,10,10,49,48]
[4,"Rik van den Beuken",1,233,9,10,10,10,10,49,45]
[7,"Kevin Slaats",1,228,10,10,9,9,10,48,46]
[8,"Sabine van Rijt",2,227,9,10,10,10,9,48,48]
[11,"Jo Peeters",3,222,9,10,10,10,9,48,47]
[22,"Etienne Deckers",1,217,8,9,10,10,10,47,43]
[23,"Jos Bongers",1,216,8,10,9,10,10,47,47]
[15,"Theo Pijls",3,220,10,8,9,10,10,47,47]
[9,"Huib Salimans",1,227,9,9,10,9,10,47,47]
[27,"Cor Joosten",1,215,10,8,10,9,10,47,40]
[5,"Ben Koper",1,229,9,10,9,9,10,47,47]
[16,"Har Luijten",3,218,10,9,9,9,10,47,47]
[10,"Peter Verstappen",3,223,9,9,10,10,9,47,45]
[6,"Henk Smolenaars",1,228,10,9,9,10,9,47,45]
[14,"Jeroen Verschuren",1,222,10,10,10,9,8,47,47]
[12,"Jac Gielen",1,222,8,9,9,10,10,46,44]
[18,"Maikel Boumans",1,218,9,8,9,10,10,46,46]
[26,"Gerard v/d Beuken",1,215,10,8,9,9,10,46,43]
[20,"Lau Geraets",1,217,10,9,9,9,9,46,44]
[25,"Marcel Walschot",1,215,10,9,9,9,9,46,41]
[24,"Math Crins",1,216,10,10,10,8,8,46,44]
[17,"Jan Sijbers",1,218,8,8,9,10,10,45,45]
[19,"Lowie Joosten",3,218,10,8,8,9,10,45,44]
[13,"Leo Pijls",1,222,9,8,9,10,9,45,43]
[21,"Marc Simons",1,217,9,8,9,10,9,45,45]
[29,"Rob Schaareman",1,214,10,7,9,10,9,45,45]
[30,"Jasper Stokmans",4,213,10,9,9,9,8,45,43]
[31,"Piet van Roy",3,213,7,10,10,9,8,44,42]
[28,"Michael Simons",1,215,10,10,8,10,6,44,42]
[]
["Groep B - 212 t/m 186 punten",null,null,null,"Hoogste serie"]
["Positie","Naam","Klasse","Punten","1","2","3","4","5","Totaal","Totaal2"]
[44,"Ad Goossens",3,204,9,9,10,10,10,48,48]
[59,"Pascal Hendriks",1,194,9,8,10,10,10,47,34]
[36,"Wiel Boonen",3,210,10,9,8,9,10,46,39]
[37,"Wim Verstappen",1,210,10,9,9,9,9,46,41]
[52,"Brianne Ghielen",5,200,10,9,9,9,9,46,33]
[39,"Johan van Rijt",1,208,10,10,8,9,9,46,42]
[38,"René Ververs",1,209,10,9,10,8,9,46,38]
[33,"Jan Derks",3,212,10,9,10,9,8,46,46]
[35,"Peter Joosten",3,210,9,9,10,7,10,45,45]
[62,"Huub Korsten",1,192,9,9,10,7,10,45,41]
[43,"Nard Roost",1,205,10,9,7,10,9,45,39]
[50,"Fred Janssen",1,202,8,7,10,9,10,44,33]
[56,"Jeroen van Nispen",5,195,8,9,8,10,9,44,42]
[46,"Harold Janshen",1,204,8,10,7,10,9,44,40]
[68,"Amber Lammers",2,187,9,9,7,10,9,44,34]
[41,"Mike Sijbers",5,208,10,8,7,10,9,44,33]
[34,"Peter Mennen",1,211,9,8,9,9,9,44,42]
[32,"Huub Sijbers",1,212,10,9,9,7,9,44,44]
[47,"Quin Hendriks",5,202,8,10,8,10,8,44,36]
[40,"Marc Schaareman",1,208,9,8,10,9,8,44,41]
[49,"Wim Janssen",3,202,9,9,10,8,8,44,43]
[42,"Olga Sijbers",5,208,10,9,9,8,8,44,39]
[57,"Koos Heijnen",1,195,10,9,7,7,10,43,30]
[66,"Ben Geraets",4,188,9,7,9,9,9,43,43]
[55,"Jan Ottenheim",3,196,10,7,8,10,8,43,33]
[65,"Jo Caalders",3,189,9,10,6,10,8,43,39]
[61,"Petra Joosten",2,192,7,10,9,9,8,43,41]
[51,"Rymon van Horne",1,201,9,10,8,10,6,43,43]
[53,"Lowie Claessen",3,199,7,8,8,9,10,42,40]
[54,"Hans Sijbers",1,198,8,9,6,10,9,42,42]
[58,"Maurice Linders",1,195,7,10,8,8,9,42,40]
[63,"Douwe Grenzenberg",1,192,9,7,9,9,8,42,35]
[45,"Thieu Jeurninck",3,204,10,8,9,7,8,42,41]
[64,"Wesley Hendriks",1,190,10,8,8,9,7,42,41]
[60,"Sjeng Boonen",1,193,8,7,8,9,9,41,41]
[48,"Ria Walschot",2,202,7,7,9,10,8,41,41]
[67,"Harry Moonen",1,188,9,9,8,7,7,40,39]
[]
["Groep C - 185 t/m 151 punten",null,null,null,"Hoogste serie"]
["Positie","Naam","Klasse","Punten","1","2","3","4","5","Totaal","Totaal2"]
[69,"Jo van Rijt",3,184,9,9,10,9,10,47,47]
[72,"Wim Hendriks",1,178,7,8,8,10,9,42,30]
[2,"Bram Walschot","N.V.T.",173,7,9,9,8,9,42,30]
[1,"Loek Hendriks","N.V.T.",177,7,10,10,8,7,42,29]
[71,"Martin Damen",1,178,8,9,8,8,8,41,36]
[73,"Frits Levels",3,175,8,5,9,8,10,40,37]
[77,"Rien van Hugten",1,170,10,7,6,8,9,40,30]
[84,"Mike Dekker",1,154,9,8,7,8,8,40,34]
[70,"Diana Sijbers",2,180,6,7,9,8,9,39,37]
[76,"Elliy Glim",3,172,10,8,6,9,6,39,36]
[79,"Willem-Jan Timmermans",1,163,5,8,8,7,10,38,38]
[82,"Jose Korsten",2,156,7,7,6,10,8,38,32]
[74,"Piet Gommans",3,174,10,6,8,8,6,38,36]
[83,"Nikki Wetjens",2,155,8,8,7,10,5,38,30]
[75,"Fried Fijten",3,173,4,8,7,8,10,37,37]
[78,"Nard Peeters",1,169,8,7,6,7,9,37,32]
[81,"Carolien van Dijk",2,156,7,9,6,8,6,36,31]
[80,"Peter van Ratingen",1,162,7,9,null,9,8,33,31]
[]
["Groep D - 150 t/m 0 punten",null,null,null,"Hoogste serie"]
["Positie","Naam","Klasse","Punten","1","2","3","4","5","Totaal","Totaal2"]
[85,"Thei Peeters",3,142,7,9,8,8,8,40,40]
[87,"Fabienne v/d Dungen",5,131,9,9,7,5,7,37,26]
[3,"Jorn Hendriks","N.V.T.",146,10,4,6,10,6,36,26]
[86,"Myrthe Das",5,135,8,7,7,7,6,35,31]
[89,"Paulien v/d Beuken",2,98,4,6,7,7,4,28,22]
[88,"Mike Koper",1,115,4,7,7,5,4,27,27]
[90,"Wim Peeters",1,93,1,5,6,5,6,23,23]
[91,"Wil Luijten",1,null,null,null,null,null,null,0,0]
[92,"Desiréé Lommen",2,null,null,null,null,null,null,0,0]
[93,"Ger Levels",1,null,null,null,null,null,null,0,0]
[94,"Theij Verdonschot",3,null,null,null,null,null,null,0,0]
[95,"Rian Jeurninck",2,null,null,null,null,null,null,0,0]
[96,"Stephan Ghielen",4,null,null,null,null,null,null,0,0]
[97,"Silfran Ghielen",1,null,null,null,null,null,null,0,0]
[98,"Aron Smolenaars",4,null,null,null,null,null,null,0,0]
[99,"Danielle Heijnen",2,null,null,null,null,null,null,0,0]
[100,"Mark Vossen",5,null,null,null,null,null,null,0,0]
[101,"Martijn Janssen",1,null,null,null,null,null,null,0,0]
[102,"Sjaak Clephas",3,null,null,null,null,null,null,0,0]
[103,"Rob van Nispen",4,null,null,null,null,null,null,0,0]
[4,null,"N.V.T.",null,null,null,null,null,null,0,0]
[5,null,"N.V.T.",null,null,null,null,null,null,0,0]
[6,null,"N.V.T.",null,null,null,null,null,null,0,0]
[7,null,"N.V.T.",null,null,null,null,null,null,0,0]
[8,null,"N.V.T.",null,null,null,null,null,null,0,0]
[9,null,"N.V.T.",null,null,null,null,null,null,0,0]
[10,null,"N.V.T.",null,null,null,null,null,null,0,0]
[11,null,"N.V.T.",null,null,null,null,null,null,0,0]
[12,null,"N.V.T.",null,null,null,null,null,null,0,0]
[13,null,"N.V.T.",null,null,null,null,null,null,0,0]
[14,null,"N.V.T.",null,null,null,null,null,null,0,0]
[15,null,"N.V.T.",null,null,null,null,null,null,0,0]
[119]
[120]
[121]
[122]
[123]
[124]
[125]
[126]

{"sheet":"Ons Genoegen","index":3,"n_rows":103,"n_cols":23,"rows_kept":103,"cut":false,"hidden":false,"merged":[[22,18,22,19],[23,18,23,19],[18,18,18,19],[1,4,1,9],[1,10,1,14],[19,18,19,19],[20,18,20,19],[21,18,21,19],[100,6,100,7],[101,6,101,7],[102,6,102,7],[99,0,99,1],[100,0,100,1],[101,0,101,1],[102,0,102,1],[100,2,100,3],[101,2,101,3],[102,2,102,3],[102,4,102,5],[99,4,99,5],[99,6,99,7],[99,2,99,3],[101,4,101,5],[100,4,100,5]]}
[null,"Ons Genoegen"]
[null,null,null,null,"Hoogste serie",null,null,null,null,null,"Laatste pijlen*"]
["Positie","Naam","Klasse","Punten","1","2","3","4","5","Totaal","21","22","23","24","25","Totaal2","Club",null,"Klasse"]
[1,"Steve Wijler",1,244,9,10,10,10,10,{"$f":"SUM(ScoresOnsGenoegen[[#This Row],[1]:[5]])","v":49},9,10,10,10,10,{"$f":"SUM(ScoresOnsGenoegen[[#This Row],[21]:[25]])","v":49},1,null,1,"Heren"]
[2,"Frank Hoogmans",1,239,9,10,10,10,10,{"$f":"SUM(ScoresOnsGenoegen[[#This Row],[1]:[5]])","v":49},10,9,9,10,10,{"$f":"SUM(ScoresOnsGenoegen[[#This Row],[21]:[25]])","v":48},1,null,2,"Dames"]
[3,"Rik van den Beuken",1,233,9,10,10,10,10,{"$f":"SUM(ScoresOnsGenoegen[[#This Row],[1]:[5]])","v":49},10,9,8,9,9,{"$f":"SUM(ScoresOnsGenoegen[[#This Row],[21]:[25]])","v":45},1,null,3,"Veteraan",null,"Van","t/m"]
[4,"Henk Smolenaars",1,228,10,9,9,10,9,{"$f":"SUM(ScoresOnsGenoegen[[#This Row],[1]:[5]])","v":47},8,8,10,9,10,{"$f":"SUM(ScoresOnsGenoegen[[#This Row],[21]:[25]])","v":45},1,null,4,"Jeugd t/m 18","Groep A",{"$f":"E101","v":1998},{"$f":"G101","v":2000}]
[5,"Kevin Slaats",1,228,10,10,9,9,10,{"$f":"SUM(ScoresOnsGenoegen[[#This Row],[1]:[5]])","v":48},9,9,10,8,10,{"$f":"SUM(ScoresOnsGenoegen[[#This Row],[21]:[25]])","v":46},1,null,5,"Jeugd t/m 15","Groep B",{"$f":"E102","v":2001},{"$f":"G102","v":2003}]
[6,"Huib Salimans",1,227,9,9,10,9,10,{"$f":"SUM(ScoresOnsGenoegen[[#This Row],[1]:[5]])","v":47},9,9,10,10,9,{"$f":"SUM(ScoresOnsGenoegen[[#This Row],[21]:[25]])","v":47},1]
[7,"Leo Pijls",1,222,9,8,9,10,9,{"$f":"SUM(ScoresOnsGenoegen[[#This Row],[1]:[5]])","v":45},9,8,8,9,9,{"$f":"SUM(ScoresOnsGenoegen[[#This Row],[21]:[25]])","v":43},1,null,null,null,","]
[8,"Theo Pijls",3,220,10,8,9,10,10,{"$f":"SUM(ScoresOnsGenoegen[[#This Row],[1]:[5]])","v":47},10,8,9,10,10,{"$f":"SUM(ScoresOnsGenoegen[[#This Row],[21]:[25]])","v":47},1,null,"Laatste pijlen"]
[9,"Lau Geraets",1,217,10,9,9,9,9,{"$f":"SUM(ScoresOnsGenoegen[[#This Row],[1]:[5]])","v":46},9,9,8,8,10,{"$f":"SUM(ScoresOnsGenoegen[[#This Row],[21]:[25]])","v":44},1,null,"Optioneel veld om automatisch sorteren mogelijk te maken"]
[10,"Jos Bongers",1,216,8,10,9,10,10,{"$f":"SUM(ScoresOnsGenoegen[[#This Row],[1]:[5]])","v":47},8,10,9,10,10,{"$f":"SUM(ScoresOnsGenoegen[[#This Row],[21]:[25]])","v":47},1,null,"Invullen zover nodig"]
[11,"Rob Schaareman",1,214,10,7,9,10,9,{"$f":"SUM(ScoresOnsGenoegen[[#This Row],[1]:[5]])","v":45},10,7,9,10,9,{"$f":"SUM(ScoresOnsGenoegen[[#This Row],[21]:[25]])","v":45},1]
[12,"Jasper Stokmans",4,213,10,9,9,9,8,{"$f":"SUM(ScoresOnsGenoegen[[#This Row],[1]:[5]])","v":45},9,8,10,8,8,{"$f":"SUM(ScoresOnsGenoegen[[#This Row],[21]:[25]])","v":43},1,null,"Uitslag maken"]
[13,"René Ververs",1,209,10,9,10,8,9,{"$f":"SUM(ScoresOnsGenoegen[[#This Row],[1]:[5]])","v":46},8,9,8,7,6,{"$f":"SUM(ScoresOnsGenoegen[[#This Row],[21]:[25]])","v":38},1,null,"Gebruik de knop 'Maak Uitslag' in het uitslagen tabblad om alle"]
[14,"Marc Schaareman",1,208,9,8,10,9,8,{"$f":"SUM(ScoresOnsGenoegen[[#This Row],[1]:[5]])","v":44},8,8,7,9,9,{"$f":"SUM(ScoresOnsGenoegen[[#This Row],[21]:[25]])","v":41},1,null,"tabbladen (incl. deze dus) te sorteren en een uitslag te maken"]
[15,"Harold Janshen",1,204,8,10,7,10,9,{"$f":"SUM(ScoresOnsGenoegen[[#This Row],[1]:[5]])","v":44},7,9,8,8,8,{"$f":"SUM(ScoresOnsGenoegen[[#This Row],[21]:[25]])","v":40},1]
[16,"Koos Heijnen",1,195,10,9,7,7,10,{"$f":"SUM(ScoresOnsGenoegen[[#This Row],[1]:[5]])","v":43},6,6,9,null,9,{"$f":"SUM(ScoresOnsGenoegen[[#This Row],[21]:[25]])","v":30},1,null,"Team",null,"Punten"]
[17,"Ben Geraets",4,188,9,7,9,9,9,{"$f":"SUM(ScoresOnsGenoegen[[#This Row],[1]:[5]])","v":43},9,7,9,9,9,{"$f":"SUM(ScoresOnsGenoegen[[#This Row],[21]:[25]])","v":43},1,null,{"$f":"CONCATENATE($B$1,\" 1\")","v":"Ons Genoegen 1"},null,{"$f":"SUM(D4:D9)","v":1399}]
[18,"Amber Lammers",2,187,9,9,7,10,9,{"$f":"SUM(ScoresOnsGenoegen[[#This Row],[1]:[5]])","v":44},7,5,7,6,9,{"$f":"SUM(ScoresOnsGenoegen[[#This Row],[21]:[25]])","v":34},1,null,{"$f":"CONCATENATE($B$1,\" 2\")","v":"Ons Genoegen 2"},null,{"$f":"SUM(D10:D15)","v":1302}]
[19,"Willem-Jan Timmermans",1,163,5,8,8,7,10,{"$f":"SUM(ScoresOnsGenoegen[[#This Row],[1]:[5]])","v":38},5,8,8,7,10,{"$f":"SUM(ScoresOnsGenoegen[[#This Row],[21]:[25]])","v":38},1,null,{"$f":"CONCATENATE($B$1,\" 3\")","v":"Ons Genoegen 3"},null,{"$f":"SUM(D16:D21)","v":1191}]
[20,"Nikki Wetjens",2,155,8,8,7,10,5,{"$f":"SUM(ScoresOnsGenoegen[[#This Row],[1]:[5]])","v":38},8,6,4,5,7,{"$f":"SUM(ScoresOnsGenoegen[[#This Row],[21]:[25]])","v":30},1,null,{"$f":"CONCATENATE($B$1,\" 4\")","v":"Ons Genoegen 4"},null,{"$f":"SUM(D22:D27)","v":318}]
[21,"Aron Smolenaars",4,null,null,null,null,null,null,{"$f":"SUM(ScoresOnsGenoegen[[#This Row],[1]:[5]])","v":0},null,null,null,null,null,{"$f":"SUM(ScoresOnsGenoegen[[#This Row],[21]:[25]])","v":0},1,null,{"$f":"CONCATENATE($B$1,\" 5\")","v":"Ons Genoegen 5"},null,{"$f":"SUM(D28:D33)","v":0}]
[22,"Danielle Heijnen",2,null,null,null,null,null,null,{"$f":"SUM(ScoresOnsGenoegen[[#This Row],[1]:[5]])","v":0},null,null,null,null,null,{"$f":"SUM(ScoresOnsGenoegen[[#This Row],[21]:[25]])","v":0},1]
[23,"Mark Vossen",5,null,null,null,null,null,null,{"$f":"SUM(ScoresOnsGenoegen[[#This Row],[1]:[5]])","v":0},null,null,null,null,null,{"$f":"SUM(ScoresOnsGenoegen[[#This Row],[21]:[25]])","v":0},1]
[24,null,null,null,null,null,null,null,null,{"$f":"SUM(ScoresOnsGenoegen[[#This Row],[1]:[5]])","v":0},null,null,null,null,null,{"$f":"SUM(ScoresOnsGenoegen[[#This Row],[21]:[25]])","v":0},1]
[25,null,null,null,null,null,null,null,null,{"$f":"SUM(ScoresOnsGenoegen[[#This Row],[1]:[5]])","v":0},null,null,null,null,null,{"$f":"SUM(ScoresOnsGenoegen[[#This Row],[21]:[25]])","v":0},1]
[26,null,null,null,null,null,null,null,null,{"$f":"SUM(ScoresOnsGenoegen[[#This Row],[1]:[5]])","v":0},null,null,null,null,null,{"$f":"SUM(ScoresOnsGenoegen[[#This Row],[21]:[25]])","v":0},1]
[27,null,null,null,null,null,null,null,null,{"$f":"SUM(ScoresOnsGenoegen[[#This Row],[1]:[5]])","v":0},null,null,null,null,null,{"$f":"SUM(ScoresOnsGenoegen[[#This Row],[21]:[25]])","v":0},1]
[28,null,null,null,null,null,null,null,null,{"$f":"SUM(ScoresOnsGenoegen[[#This Row],[1]:[5]])","v":0},null,null,null,null,null,{"$f":"SUM(ScoresOnsGenoegen[[#This Row],[21]:[25]])","v":0},1]
[29,null,null,null,null,null,null,null,null,{"$f":"SUM(ScoresOnsGenoegen[[#This Row],[1]:[5]])","v":0},null,null,null,null,null,{"$f":"SUM(ScoresOnsGenoegen[[#This Row],[21]:[25]])","v":0},1]
[30,null,null,null,null,null,null,null,null,{"$f":"SUM(ScoresOnsGenoegen[[#This Row],[1]:[5]])","v":0},null,null,null,null,null,{"$f":"SUM(ScoresOnsGenoegen[[#This Row],[21]:[25]])","v":0},1]
[]
[]
[]
[]
[]
[]
[]
[]
[]
[]
[]
[]
[]
[]
[]
[]
[]
[]
[]
[]
[]
[]
[]
[]
[]
[]
[]
[]
[]
[]
[]
[]
[]
[]
[]
[]
[]
[]
[]
[]
[]
[]
[]
[]
[]
[]
[]
[]
[]
[]
[]
[]
[]
[]
[]
[]
[]
[]
[]
[]
[]
[]
[]
[]
[]
[]
["Actueel jaar",null,{"$f":"'# Onderlinge'!M1","v":2016},null,"Van",null,"t/m"]
["Jeugd Klasse A",null,"16 t/m 18 jr",null,{"$f":"C100-18","v":1998},null,{"$f":"C100-16","v":2000}]
["Jeugd Klasse B",null,"13 t/m 15 jr",null,{"$f":"C100-15","v":2001},null,{"$f":"C100-13","v":2003}]
["Jeugd Klasse C",null,"t/m 12 jr",null,{"$f":"C100-12","v":2004},null,{"$f":"C100","v":2016}]

{"sheet":"Buitenlust","index":4,"n_rows":103,"n_cols":23,"rows_kept":103,"cut":false,"hidden":false,"merged":[[21,18,21,19],[22,18,22,19],[23,18,23,19],[1,4,1,9],[1,10,1,14],[18,18,18,19],[19,18,19,19],[20,18,20,19],[102,0,102,1],[102,2,102,3],[102,4,102,5],[102,6,102,7],[99,0,99,1],[99,2,99,3],[99,4,99,5],[99,6,99,7],[100,0,100,1],[100,2,100,3],[100,4,100,5],[100,6,100,7],[101,0,101,1],[101,2,101,3],[101,4,101,5],[101,6,101,7]]}
[null,"Buitenlust"]
[null,null,null,null,"Hoogste serie",null,null,null,null,null,"Laatste pijlen*"]
["Positie","Naam","Klasse","Punten","1","2","3","4","5","Totaal","21","22","23","24","25","Totaal2","Club",null,"Klasse"]
[1,"Jac Gielen",1,222,8,9,9,10,10,{"$f":"SUM(ScoresBuitenlust[[#This Row],[1]:[5]])","v":46},10,6,9,9,10,{"$f":"SUM(ScoresBuitenlust[[#This Row],[21]:[25]])","v":44},2,null,1,"Heren"]
[2,"Har Luijten",3,218,10,9,9,9,10,{"$f":"SUM(ScoresBuitenlust[[#This Row],[1]:[5]])","v":47},10,9,9,9,10,{"$f":"SUM(ScoresBuitenlust[[#This Row],[21]:[25]])","v":47},2,null,2,"Dames"]
[3,"Gerard v/d Beuken",1,215,10,8,9,9,10,{"$f":"SUM(ScoresBuitenlust[[#This Row],[1]:[5]])","v":46},9,10,8,7,9,{"$f":"SUM(ScoresBuitenlust[[#This Row],[21]:[25]])","v":43},2,null,3,"Veteraan",null,"Van","t/m"]
[4,"Jo Caalders",3,189,9,10,6,10,8,{"$f":"SUM(ScoresBuitenlust[[#This Row],[1]:[5]])","v":43},5,6,10,9,9,{"$f":"SUM(ScoresBuitenlust[[#This Row],[21]:[25]])","v":39},2,null,4,"Jeugd t/m 18","Groep A",{"$f":"E101","v":1998},{"$f":"G101","v":2000}]
[5,"Martin Damen",1,178,8,9,8,8,8,{"$f":"SUM(ScoresBuitenlust[[#This Row],[1]:[5]])","v":41},8,8,7,3,10,{"$f":"SUM(ScoresBuitenlust[[#This Row],[21]:[25]])","v":36},2,null,5,"Jeugd t/m 15","Groep B",{"$f":"E102","v":2001},{"$f":"G102","v":2003}]
[6,"Mike Dekker",1,154,9,8,7,8,8,{"$f":"SUM(ScoresBuitenlust[[#This Row],[1]:[5]])","v":40},8,8,6,7,5,{"$f":"SUM(ScoresBuitenlust[[#This Row],[21]:[25]])","v":34},2]
[7,"Paulien v/d Beuken",2,98,4,6,7,7,4,{"$f":"SUM(ScoresBuitenlust[[#This Row],[1]:[5]])","v":28},4,9,2,6,1,{"$f":"SUM(ScoresBuitenlust[[#This Row],[21]:[25]])","v":22},2]
[8,"Wim Peeters",1,93,1,5,6,5,6,{"$f":"SUM(ScoresBuitenlust[[#This Row],[1]:[5]])","v":23},1,5,6,5,6,{"$f":"SUM(ScoresBuitenlust[[#This Row],[21]:[25]])","v":23},2,null,"Laatste pijlen"]
[9,"Wil Luijten",1,null,null,null,null,null,null,{"$f":"SUM(ScoresBuitenlust[[#This Row],[1]:[5]])","v":0},null,null,null,null,null,{"$f":"SUM(ScoresBuitenlust[[#This Row],[21]:[25]])","v":0},2,null,"Optioneel veld om automatisch sorteren mogelijk te maken"]
[10,null,null,null,null,null,null,null,null,{"$f":"SUM(ScoresBuitenlust[[#This Row],[1]:[5]])","v":0},null,null,null,null,null,{"$f":"SUM(ScoresBuitenlust[[#This Row],[21]:[25]])","v":0},2,null,"Invullen zover nodig"]
[11,null,null,null,null,null,null,null,null,{"$f":"SUM(ScoresBuitenlust[[#This Row],[1]:[5]])","v":0},null,null,null,null,null,{"$f":"SUM(ScoresBuitenlust[[#This Row],[21]:[25]])","v":0},2]
[12,null,null,null,null,null,null,null,null,{"$f":"SUM(ScoresBuitenlust[[#This Row],[1]:[5]])","v":0},null,null,null,null,null,{"$f":"SUM(ScoresBuitenlust[[#This Row],[21]:[25]])","v":0},2,null,"Uitslag maken"]
[13,null,null,null,null,null,null,null,null,{"$f":"SUM(ScoresBuitenlust[[#This Row],[1]:[5]])","v":0},null,null,null,null,null,{"$f":"SUM(ScoresBuitenlust[[#This Row],[21]:[25]])","v":0},2,null,"Gebruik de knop 'Maak Uitslag' in het uitslagen tabblad om alle"]
[14,null,null,null,null,null,null,null,null,{"$f":"SUM(ScoresBuitenlust[[#This Row],[1]:[5]])","v":0},null,null,null,null,null,{"$f":"SUM(ScoresBuitenlust[[#This Row],[21]:[25]])","v":0},2,null,"tabbladen (incl. deze dus) te sorteren en een uitslag te maken"]
[15,null,null,null,null,null,null,null,null,{"$f":"SUM(ScoresBuitenlust[[#This Row],[1]:[5]])","v":0},null,null,null,null,null,{"$f":"SUM(ScoresBuitenlust[[#This Row],[21]:[25]])","v":0},2]
[16,null,null,null,null,null,null,null,null,{"$f":"SUM(ScoresBuitenlust[[#This Row],[1]:[5]])","v":0},null,null,null,null,null,{"$f":"SUM(ScoresBuitenlust[[#This Row],[21]:[25]])","v":0},2,null,"Team",null,"Punten"]
[17,null,null,null,null,null,null,null,null,{"$f":"SUM(ScoresBuitenlust[[#This Row],[1]:[5]])","v":0},null,null,null,null,null,{"$f":"SUM(ScoresBuitenlust[[#This Row],[21]:[25]])","v":0},2,null,{"$f":"CONCATENATE($B$1,\" 1\")","v":"Buitenlust 1"},null,{"$f":"SUM(D4:D9)","v":1176}]
[18,null,null,null,null,null,null,null,null,{"$f":"SUM(ScoresBuitenlust[[#This Row],[1]:[5]])","v":0},null,null,null,null,null,{"$f":"SUM(ScoresBuitenlust[[#This Row],[21]:[25]])","v":0},2,null,{"$f":"CONCATENATE($B$1,\" 2\")","v":"Buitenlust 2"},null,{"$f":"SUM(D10:D15)","v":191}]
[19,null,null,null,null,null,null,null,null,{"$f":"SUM(ScoresBuitenlust[[#This Row],[1]:[5]])","v":0},null,null,null,null,null,{"$f":"SUM(ScoresBuitenlust[[#This Row],[21]:[25]])","v":0},2,null,{"$f":"CONCATENATE($B$1,\" 3\")","v":"Buitenlust 3"},null,{"$f":"SUM(D16:D21)","v":0}]
[20,null,null,null,null,null,null,null,null,{"$f":"SUM(ScoresBuitenlust[[#This Row],[1]:[5]])","v":0},null,null,null,null,null,{"$f":"SUM(ScoresBuitenlust[[#This Row],[21]:[25]])","v":0},2,null,{"$f":"CONCATENATE($B$1,\" 4\")","v":"Buitenlust 4"},null,{"$f":"SUM(D22:D27)","v":0}]
[21,null,null,null,null,null,null,null,null,{"$f":"SUM(ScoresBuitenlust[[#This Row],[1]:[5]])","v":0},null,null,null,null,null,{"$f":"SUM(ScoresBuitenlust[[#This Row],[21]:[25]])","v":0},2,null,{"$f":"CONCATENATE($B$1,\" 5\")","v":"Buitenlust 5"},null,{"$f":"SUM(D28:D33)","v":0}]
[22,null,null,null,null,null,null,null,null,{"$f":"SUM(ScoresBuitenlust[[#This Row],[1]:[5]])","v":0},null,null,null,null,null,{"$f":"SUM(ScoresBuitenlust[[#This Row],[21]:[25]])","v":0},2]
[23,null,null,null,null,null,null,null,null,{"$f":"SUM(ScoresBuitenlust[[#This Row],[1]:[5]])","v":0},null,null,null,null,null,{"$f":"SUM(ScoresBuitenlust[[#This Row],[21]:[25]])","v":0},2]
[24,null,null,null,null,null,null,null,null,{"$f":"SUM(ScoresBuitenlust[[#This Row],[1]:[5]])","v":0},null,null,null,null,null,{"$f":"SUM(ScoresBuitenlust[[#This Row],[21]:[25]])","v":0},2]
[25,null,null,null,null,null,null,null,null,{"$f":"SUM(ScoresBuitenlust[[#This Row],[1]:[5]])","v":0},null,null,null,null,null,{"$f":"SUM(ScoresBuitenlust[[#This Row],[21]:[25]])","v":0},2]
[26,null,null,null,null,null,null,null,null,{"$f":"SUM(ScoresBuitenlust[[#This Row],[1]:[5]])","v":0},null,null,null,null,null,{"$f":"SUM(ScoresBuitenlust[[#This Row],[21]:[25]])","v":0},2]
[27,null,null,null,null,null,null,null,null,{"$f":"SUM(ScoresBuitenlust[[#This Row],[1]:[5]])","v":0},null,null,null,null,null,{"$f":"SUM(ScoresBuitenlust[[#This Row],[21]:[25]])","v":0},2]
[28,null,null,null,null,null,null,null,null,{"$f":"SUM(ScoresBuitenlust[[#This Row],[1]:[5]])","v":0},null,null,null,null,null,{"$f":"SUM(ScoresBuitenlust[[#This Row],[21]:[25]])","v":0},2]
[29,null,null,null,null,null,null,null,null,{"$f":"SUM(ScoresBuitenlust[[#This Row],[1]:[5]])","v":0},null,null,null,null,null,{"$f":"SUM(ScoresBuitenlust[[#This Row],[21]:[25]])","v":0},2]
[30,null,null,null,null,null,null,null,null,{"$f":"SUM(ScoresBuitenlust[[#This Row],[1]:[5]])","v":0},null,null,null,null,null,{"$f":"SUM(ScoresBuitenlust[[#This Row],[21]:[25]])","v":0},2]
[]
[]
[]
[]
[]
[]
[]
[]
[]
[]
[]
[]
[]
[]
[]
[]
[]
[]
[]
[]
[]
[]
[]
[]
[]
[]
[]
[]
[]
[]
[]
[]
[]
[]
[]
[]
[]
[]
[]
[]
[]
[]
[]
[]
[]
[]
[]
[]
[]
[]
[]
[]
[]
[]
[]
[]
[]
[]
[]
[]
[]
[]
[]
[]
[]
[]
["Actueel jaar",null,{"$f":"'# Onderlinge'!M1","v":2016},null,"Van",null,"t/m"]
["Jeugd Klasse A",null,"16 t/m 18 jr",null,{"$f":"C100-18","v":1998},null,{"$f":"C100-16","v":2000}]
["Jeugd Klasse B",null,"13 t/m 15 jr",null,{"$f":"C100-15","v":2001},null,{"$f":"C100-13","v":2003}]
["Jeugd Klasse C",null,"t/m 12 jr",null,{"$f":"C100-12","v":2004},null,{"$f":"C100","v":2016}]

{"sheet":"Roos in Bloei","index":5,"n_rows":103,"n_cols":23,"rows_kept":103,"cut":false,"hidden":false,"merged":[[21,18,21,19],[22,18,22,19],[23,18,23,19],[1,4,1,9],[1,10,1,14],[18,18,18,19],[19,18,19,19],[20,18,20,19],[99,0,99,1],[99,2,99,3],[99,4,99,5],[99,6,99,7],[100,0,100,1],[100,2,100,3],[100,4,100,5],[100,6,100,7],[101,0,101,1],[101,2,101,3],[101,4,101,5],[101,6,101,7],[102,0,102,1],[102,2,102,3],[102,4,102,5],[102,6,102,7]]}
[null,"Roos in Bloei"]
[null,null,null,null,"Hoogste serie",null,null,null,null,null,"Laatste pijlen*"]
["Positie","Naam","Klasse","Punten","1","2","3","4","5","Totaal","21","22","23","24","25","Totaal2","Club",null,"Klasse"]
[1,"Jeroen Verschuren",1,222,10,10,10,9,8,{"$f":"SUM(ScoresRoosInBloei[[#This Row],[1]:[5]])","v":47},10,10,10,9,8,{"$f":"SUM(ScoresRoosInBloei[[#This Row],[21]:[25]])","v":47},3,null,1,"Heren"]
[2,"Jan Sijbers",1,218,8,8,9,10,10,{"$f":"SUM(ScoresRoosInBloei[[#This Row],[1]:[5]])","v":45},10,10,6,9,10,{"$f":"SUM(ScoresRoosInBloei[[#This Row],[21]:[25]])","v":45},3,null,2,"Dames"]
[3,"Etienne Deckers",1,217,8,9,10,10,10,{"$f":"SUM(ScoresRoosInBloei[[#This Row],[1]:[5]])","v":47},9,9,9,8,8,{"$f":"SUM(ScoresRoosInBloei[[#This Row],[21]:[25]])","v":43},3,null,3,"Veteraan",null,"Van","t/m"]
[4,"Peter Mennen",1,211,9,8,9,9,9,{"$f":"SUM(ScoresRoosInBloei[[#This Row],[1]:[5]])","v":44},10,7,10,8,7,{"$f":"SUM(ScoresRoosInBloei[[#This Row],[21]:[25]])","v":42},3,null,4,"Jeugd t/m 18","Groep A",{"$f":"E101","v":1998},{"$f":"G101","v":2000}]
[5,"Thieu Jeurninck",3,204,10,8,9,7,8,{"$f":"SUM(ScoresRoosInBloei[[#This Row],[1]:[5]])","v":42},7,8,9,8,9,{"$f":"SUM(ScoresRoosInBloei[[#This Row],[21]:[25]])","v":41},3,null,5,"Jeugd t/m 15","Groep B",{"$f":"E102","v":2001},{"$f":"G102","v":2003}]
[6,"Quin Hendriks",5,202,8,10,8,10,8,{"$f":"SUM(ScoresRoosInBloei[[#This Row],[1]:[5]])","v":44},8,9,9,null,10,{"$f":"SUM(ScoresRoosInBloei[[#This Row],[21]:[25]])","v":36},3]
[7,"Jeroen van Nispen",5,195,8,9,8,10,9,{"$f":"SUM(ScoresRoosInBloei[[#This Row],[1]:[5]])","v":44},8,8,7,9,10,{"$f":"SUM(ScoresRoosInBloei[[#This Row],[21]:[25]])","v":42},3]
[8,"Pascal Hendriks",1,194,9,8,10,10,10,{"$f":"SUM(ScoresRoosInBloei[[#This Row],[1]:[5]])","v":47},8,null,9,9,8,{"$f":"SUM(ScoresRoosInBloei[[#This Row],[21]:[25]])","v":34},3,null,"Laatste pijlen"]
[9,"Sjeng Boonen",1,193,8,7,8,9,9,{"$f":"SUM(ScoresRoosInBloei[[#This Row],[1]:[5]])","v":41},8,7,8,9,9,{"$f":"SUM(ScoresRoosInBloei[[#This Row],[21]:[25]])","v":41},3,null,"Optioneel veld om automatisch sorteren mogelijk te maken"]
[10,"Douwe Grenzenberg",1,192,9,7,9,9,8,{"$f":"SUM(ScoresRoosInBloei[[#This Row],[1]:[5]])","v":42},8,6,8,8,5,{"$f":"SUM(ScoresRoosInBloei[[#This Row],[21]:[25]])","v":35},3,null,"Invullen zover nodig"]
[11,"Wesley Hendriks",1,190,10,8,8,9,7,{"$f":"SUM(ScoresRoosInBloei[[#This Row],[1]:[5]])","v":42},9,7,9,10,6,{"$f":"SUM(ScoresRoosInBloei[[#This Row],[21]:[25]])","v":41},3]
[12,"Wim Hendriks",1,178,7,8,8,10,9,{"$f":"SUM(ScoresRoosInBloei[[#This Row],[1]:[5]])","v":42},2,7,8,7,6,{"$f":"SUM(ScoresRoosInBloei[[#This Row],[21]:[25]])","v":30},3,null,"Uitslag maken"]
[13,"Piet Gommans",3,174,10,6,8,8,6,{"$f":"SUM(ScoresRoosInBloei[[#This Row],[1]:[5]])","v":38},9,8,5,6,8,{"$f":"SUM(ScoresRoosInBloei[[#This Row],[21]:[25]])","v":36},3,null,"Gebruik de knop 'Maak Uitslag' in het uitslagen tabblad om alle"]
[14,"Martijn Janssen",1,null,null,null,null,null,null,{"$f":"SUM(ScoresRoosInBloei[[#This Row],[1]:[5]])","v":0},null,null,null,null,null,{"$f":"SUM(ScoresRoosInBloei[[#This Row],[21]:[25]])","v":0},3,null,"tabbladen (incl. deze dus) te sorteren en een uitslag te maken"]
[15,"Sjaak Clephas",3,null,null,null,null,null,null,{"$f":"SUM(ScoresRoosInBloei[[#This Row],[1]:[5]])","v":0},null,null,null,null,null,{"$f":"SUM(ScoresRoosInBloei[[#This Row],[21]:[25]])","v":0},3]
[16,"Rob van Nispen",4,null,null,null,null,null,null,{"$f":"SUM(ScoresRoosInBloei[[#This Row],[1]:[5]])","v":0},null,null,null,null,null,{"$f":"SUM(ScoresRoosInBloei[[#This Row],[21]:[25]])","v":0},3,null,"Team",null,"Punten"]
[17,null,null,null,null,null,null,null,null,{"$f":"SUM(ScoresRoosInBloei[[#This Row],[1]:[5]])","v":0},null,null,null,null,null,{"$f":"SUM(ScoresRoosInBloei[[#This Row],[21]:[25]])","v":0},3,null,{"$f":"CONCATENATE($B$1,\" 1\")","v":"Roos in Bloei 1"},null,{"$f":"SUM(D4:D9)","v":1274}]
[18,null,null,null,null,null,null,null,null,{"$f":"SUM(ScoresRoosInBloei[[#This Row],[1]:[5]])","v":0},null,null,null,null,null,{"$f":"SUM(ScoresRoosInBloei[[#This Row],[21]:[25]])","v":0},3,null,{"$f":"CONCATENATE($B$1,\" 2\")","v":"Roos in Bloei 2"},null,{"$f":"SUM(D10:D15)","v":1142}]
[19,null,null,null,null,null,null,null,null,{"$f":"SUM(ScoresRoosInBloei[[#This Row],[1]:[5]])","v":0},null,null,null,null,null,{"$f":"SUM(ScoresRoosInBloei[[#This Row],[21]:[25]])","v":0},3,null,{"$f":"CONCATENATE($B$1,\" 3\")","v":"Roos in Bloei 3"},null,{"$f":"SUM(D16:D21)","v":174}]
[20,null,null,null,null,null,null,null,null,{"$f":"SUM(ScoresRoosInBloei[[#This Row],[1]:[5]])","v":0},null,null,null,null,null,{"$f":"SUM(ScoresRoosInBloei[[#This Row],[21]:[25]])","v":0},3,null,{"$f":"CONCATENATE($B$1,\" 4\")","v":"Roos in Bloei 4"},null,{"$f":"SUM(D22:D27)","v":0}]
[21,null,null,null,null,null,null,null,null,{"$f":"SUM(ScoresRoosInBloei[[#This Row],[1]:[5]])","v":0},null,null,null,null,null,{"$f":"SUM(ScoresRoosInBloei[[#This Row],[21]:[25]])","v":0},3,null,{"$f":"CONCATENATE($B$1,\" 5\")","v":"Roos in Bloei 5"},null,{"$f":"SUM(D28:D33)","v":0}]
[22,null,null,null,null,null,null,null,null,{"$f":"SUM(ScoresRoosInBloei[[#This Row],[1]:[5]])","v":0},null,null,null,null,null,{"$f":"SUM(ScoresRoosInBloei[[#This Row],[21]:[25]])","v":0},3]
[23,null,null,null,null,null,null,null,null,{"$f":"SUM(ScoresRoosInBloei[[#This Row],[1]:[5]])","v":0},null,null,null,null,null,{"$f":"SUM(ScoresRoosInBloei[[#This Row],[21]:[25]])","v":0},3]
[24,null,null,null,null,null,null,null,null,{"$f":"SUM(ScoresRoosInBloei[[#This Row],[1]:[5]])","v":0},null,null,null,null,null,{"$f":"SUM(ScoresRoosInBloei[[#This Row],[21]:[25]])","v":0},3]
[25,null,null,null,null,null,null,null,null,{"$f":"SUM(ScoresRoosInBloei[[#This Row],[1]:[5]])","v":0},null,null,null,null,null,{"$f":"SUM(ScoresRoosInBloei[[#This Row],[21]:[25]])","v":0},3]
[26,null,null,null,null,null,null,null,null,{"$f":"SUM(ScoresRoosInBloei[[#This Row],[1]:[5]])","v":0},null,null,null,null,null,{"$f":"SUM(ScoresRoosInBloei[[#This Row],[21]:[25]])","v":0},3]
[27,null,null,null,null,null,null,null,null,{"$f":"SUM(ScoresRoosInBloei[[#This Row],[1]:[5]])","v":0},null,null,null,null,null,{"$f":"SUM(ScoresRoosInBloei[[#This Row],[21]:[25]])","v":0},3]
[28,null,null,null,null,null,null,null,null,{"$f":"SUM(ScoresRoosInBloei[[#This Row],[1]:[5]])","v":0},null,null,null,null,null,{"$f":"SUM(ScoresRoosInBloei[[#This Row],[21]:[25]])","v":0},3]
[29,null,null,null,null,null,null,null,null,{"$f":"SUM(ScoresRoosInBloei[[#This Row],[1]:[5]])","v":0},null,null,null,null,null,{"$f":"SUM(ScoresRoosInBloei[[#This Row],[21]:[25]])","v":0},3]
[30,null,null,null,null,null,null,null,null,{"$f":"SUM(ScoresRoosInBloei[[#This Row],[1]:[5]])","v":0},null,null,null,null,null,{"$f":"SUM(ScoresRoosInBloei[[#This Row],[21]:[25]])","v":0},3]
[]
[]
[]
[]
[]
[]
[]
[]
[]
[]
[]
[]
[]
[]
[]
[]
[]
[]
[]
[]
[]
[]
[]
[]
[]
[]
[]
[]
[]
[]
[]
[]
[]
[]
[]
[]
[]
[]
[]
[]
[]
[]
[]
[]
[]
[]
[]
[]
[]
[]
[]
[]
[]
[]
[]
[]
[]
[]
[]
[]
[]
[]
[]
[]
[]
[]
["Actueel jaar",null,{"$f":"'# Onderlinge'!M1","v":2016},null,"Van",null,"t/m"]
["Jeugd Klasse A",null,"16 t/m 18 jr",null,{"$f":"C100-18","v":1998},null,{"$f":"C100-16","v":2000}]
["Jeugd Klasse B",null,"13 t/m 15 jr",null,{"$f":"C100-15","v":2001},null,{"$f":"C100-13","v":2003}]
["Jeugd Klasse C",null,"t/m 12 jr",null,{"$f":"C100-12","v":2004},null,{"$f":"C100","v":2016}]

{"sheet":"Heidebloem","index":6,"n_rows":103,"n_cols":23,"rows_kept":103,"cut":false,"hidden":false,"merged":[[21,18,21,19],[22,18,22,19],[23,18,23,19],[1,4,1,9],[1,10,1,14],[18,18,18,19],[19,18,19,19],[20,18,20,19],[99,0,99,1],[99,2,99,3],[99,4,99,5],[99,6,99,7],[100,0,100,1],[100,2,100,3],[100,4,100,5],[100,6,100,7],[101,0,101,1],[101,2,101,3],[101,4,101,5],[101,6,101,7],[102,0,102,1],[102,2,102,3],[102,4,102,5],[102,6,102,7]]}
[null,"Heidebloem"]
[null,null,null,null,"Hoogste serie",null,null,null,null,null,"Laatste pijlen*"]
["Positie","Naam","Klasse","Punten","1","2","3","4","5","Totaal","21","22","23","24","25","Totaal2","Club",null,"Klasse"]
[1,"Sabine van Rijt",2,227,9,10,10,10,9,{"$f":"SUM(ScoresHeidebloem[[#This Row],[1]:[5]])","v":48},9,10,10,10,9,{"$f":"SUM(ScoresHeidebloem[[#This Row],[21]:[25]])","v":48},4,null,1,"Heren"]
[2,"Lowie Joosten",3,218,10,8,8,9,10,{"$f":"SUM(ScoresHeidebloem[[#This Row],[1]:[5]])","v":45},10,8,8,10,8,{"$f":"SUM(ScoresHeidebloem[[#This Row],[21]:[25]])","v":44},4,null,2,"Dames"]
[3,"Piet van Roy",3,213,7,10,10,9,8,{"$f":"SUM(ScoresHeidebloem[[#This Row],[1]:[5]])","v":44},9,10,6,10,7,{"$f":"SUM(ScoresHeidebloem[[#This Row],[21]:[25]])","v":42},4,null,3,"Veteraan",null,"Van","t/m"]
[4,"Peter Joosten",3,210,9,9,10,7,10,{"$f":"SUM(ScoresHeidebloem[[#This Row],[1]:[5]])","v":45},9,9,10,7,10,{"$f":"SUM(ScoresHeidebloem[[#This Row],[21]:[25]])","v":45},4,null,4,"Jeugd t/m 18","Groep A",{"$f":"E101","v":1998},{"$f":"G101","v":2000}]
[5,"Wiel Boonen",3,210,10,9,8,9,10,{"$f":"SUM(ScoresHeidebloem[[#This Row],[1]:[5]])","v":46},10,7,6,7,9,{"$f":"SUM(ScoresHeidebloem[[#This Row],[21]:[25]])","v":39},4,null,5,"Jeugd t/m 15","Groep B",{"$f":"E102","v":2001},{"$f":"G102","v":2003}]
[6,"Wim Verstappen",1,210,10,9,9,9,9,{"$f":"SUM(ScoresHeidebloem[[#This Row],[1]:[5]])","v":46},9,8,9,9,6,{"$f":"SUM(ScoresHeidebloem[[#This Row],[21]:[25]])","v":41},4]
[7,"Johan van Rijt",1,208,10,10,8,9,9,{"$f":"SUM(ScoresHeidebloem[[#This Row],[1]:[5]])","v":46},8,7,9,9,9,{"$f":"SUM(ScoresHeidebloem[[#This Row],[21]:[25]])","v":42},4]
[8,"Nard Roost",1,205,10,9,7,10,9,{"$f":"SUM(ScoresHeidebloem[[#This Row],[1]:[5]])","v":45},8,7,7,8,9,{"$f":"SUM(ScoresHeidebloem[[#This Row],[21]:[25]])","v":39},4,null,"Laatste pijlen"]
[9,"Ad Goossens",3,204,9,9,10,10,10,{"$f":"SUM(ScoresHeidebloem[[#This Row],[1]:[5]])","v":48},9,9,10,10,10,{"$f":"SUM(ScoresHeidebloem[[#This Row],[21]:[25]])","v":48},4,null,"Optioneel veld om automatisch sorteren mogelijk te maken"]
[10,"Rymon van Horne",1,201,9,10,8,10,6,{"$f":"SUM(ScoresHeidebloem[[#This Row],[1]:[5]])","v":43},9,10,8,10,6,{"$f":"SUM(ScoresHeidebloem[[#This Row],[21]:[25]])","v":43},4,null,"Invullen zover nodig"]
[11,"Lowie Claessen",3,199,7,8,8,9,10,{"$f":"SUM(ScoresHeidebloem[[#This Row],[1]:[5]])","v":42},9,8,7,8,8,{"$f":"SUM(ScoresHeidebloem[[#This Row],[21]:[25]])","v":40},4]
[12,"Jo van Rijt",3,184,9,9,10,9,10,{"$f":"SUM(ScoresHeidebloem[[#This Row],[1]:[5]])","v":47},9,9,10,9,10,{"$f":"SUM(ScoresHeidebloem[[#This Row],[21]:[25]])","v":47},4,null,"Uitslag maken"]
[13,"Frits Levels",3,175,8,5,9,8,10,{"$f":"SUM(ScoresHeidebloem[[#This Row],[1]:[5]])","v":40},7,8,9,7,6,{"$f":"SUM(ScoresHeidebloem[[#This Row],[21]:[25]])","v":37},4,null,"Gebruik de knop 'Maak Uitslag' in het uitslagen tabblad om alle"]
[14,"Elliy Glim",3,172,10,8,6,9,6,{"$f":"SUM(ScoresHeidebloem[[#This Row],[1]:[5]])","v":39},5,7,9,7,8,{"$f":"SUM(ScoresHeidebloem[[#This Row],[21]:[25]])","v":36},4,null,"tabbladen (incl. deze dus) te sorteren en een uitslag te maken"]
[15,"Rien van Hugten",1,170,10,7,6,8,9,{"$f":"SUM(ScoresHeidebloem[[#This Row],[1]:[5]])","v":40},5,8,6,6,5,{"$f":"SUM(ScoresHeidebloem[[#This Row],[21]:[25]])","v":30},4]
[16,"Nard Peeters",1,169,8,7,6,7,9,{"$f":"SUM(ScoresHeidebloem[[#This Row],[1]:[5]])","v":37},7,5,8,4,8,{"$f":"SUM(ScoresHeidebloem[[#This Row],[21]:[25]])","v":32},4,null,"Team",null,"Punten"]
[17,"Peter van Ratingen",1,162,7,9,null,9,8,{"$f":"SUM(ScoresHeidebloem[[#This Row],[1]:[5]])","v":33},9,9,null,8,5,{"$f":"SUM(ScoresHeidebloem[[#This Row],[21]:[25]])","v":31},4,null,{"$f":"CONCATENATE($B$1,\" 1\")","v":"Heidebloem 1"},null,{"$f":"SUM(D4:D9)","v":1288}]
[18,"Desiréé Lommen",2,null,null,null,null,null,null,{"$f":"SUM(ScoresHeidebloem[[#This Row],[1]:[5]])","v":0},null,null,null,null,null,{"$f":"SUM(ScoresHeidebloem[[#This Row],[21]:[25]])","v":0},4,null,{"$f":"CONCATENATE($B$1,\" 2\")","v":"Heidebloem 2"},null,{"$f":"SUM(D10:D15)","v":1201}]
[19,"Ger Levels",1,null,null,null,null,null,null,{"$f":"SUM(ScoresHeidebloem[[#This Row],[1]:[5]])","v":0},null,null,null,null,null,{"$f":"SUM(ScoresHeidebloem[[#This Row],[21]:[25]])","v":0},4,null,{"$f":"CONCATENATE($B$1,\" 3\")","v":"Heidebloem 3"},null,{"$f":"SUM(D16:D21)","v":848}]
[20,"Theij Verdonschot",3,null,null,null,null,null,null,{"$f":"SUM(ScoresHeidebloem[[#This Row],[1]:[5]])","v":0},null,null,null,null,null,{"$f":"SUM(ScoresHeidebloem[[#This Row],[21]:[25]])","v":0},4,null,{"$f":"CONCATENATE($B$1,\" 4\")","v":"Heidebloem 4"},null,{"$f":"SUM(D22:D27)","v":0}]
[21,null,null,null,null,null,null,null,null,{"$f":"SUM(ScoresHeidebloem[[#This Row],[1]:[5]])","v":0},null,null,null,null,null,{"$f":"SUM(ScoresHeidebloem[[#This Row],[21]:[25]])","v":0},4,null,{"$f":"CONCATENATE($B$1,\" 5\")","v":"Heidebloem 5"},null,{"$f":"SUM(D28:D33)","v":0}]
[22,null,null,null,null,null,null,null,null,{"$f":"SUM(ScoresHeidebloem[[#This Row],[1]:[5]])","v":0},null,null,null,null,null,{"$f":"SUM(ScoresHeidebloem[[#This Row],[21]:[25]])","v":0},4]
[23,null,null,null,null,null,null,null,null,{"$f":"SUM(ScoresHeidebloem[[#This Row],[1]:[5]])","v":0},null,null,null,null,null,{"$f":"SUM(ScoresHeidebloem[[#This Row],[21]:[25]])","v":0},4]
[24,null,null,null,null,null,null,null,null,{"$f":"SUM(ScoresHeidebloem[[#This Row],[1]:[5]])","v":0},null,null,null,null,null,{"$f":"SUM(ScoresHeidebloem[[#This Row],[21]:[25]])","v":0},4]
[25,null,null,null,null,null,null,null,null,{"$f":"SUM(ScoresHeidebloem[[#This Row],[1]:[5]])","v":0},null,null,null,null,null,{"$f":"SUM(ScoresHeidebloem[[#This Row],[21]:[25]])","v":0},4]
[26,null,null,null,null,null,null,null,null,{"$f":"SUM(ScoresHeidebloem[[#This Row],[1]:[5]])","v":0},null,null,null,null,null,{"$f":"SUM(ScoresHeidebloem[[#This Row],[21]:[25]])","v":0},4]
[27,null,null,null,null,null,null,null,null,{"$f":"SUM(ScoresHeidebloem[[#This Row],[1]:[5]])","v":0},null,null,null,null,null,{"$f":"SUM(ScoresHeidebloem[[#This Row],[21]:[25]])","v":0},4]
[28,null,null,null,null,null,null,null,null,{"$f":"SUM(ScoresHeidebloem[[#This Row],[1]:[5]])","v":0},null,null,null,null,null,{"$f":"SUM(ScoresHeidebloem[[#This Row],[21]:[25]])","v":0},4]
[29,null,null,null,null,null,null,null,null,{"$f":"SUM(ScoresHeidebloem[[#This Row],[1]:[5]])","v":0},null,null,null,null,null,{"$f":"SUM(ScoresHeidebloem[[#This Row],[21]:[25]])","v":0},4]
[30,null,null,null,null,null,null,null,null,{"$f":"SUM(ScoresHeidebloem[[#This Row],[1]:[5]])","v":0},null,null,null,null,null,{"$f":"SUM(ScoresHeidebloem[[#This Row],[21]:[25]])","v":0},4]
[]
[]
[]
[]
[]
[]
[]
[]
[]
[]
[]
[]
[]
[]
[]
[]
[]
[]
[]
[]
[]
[]
[]
[]
[]
[]
[]
[]
[]
[]
[]
[]
[]
[]
[]
[]
[]
[]
[]
[]
[]
[]
[]
[]
[]
[]
[]
[]
[]
[]
[]
[]
[]
[]
[]
[]
[]
[]
[]
[]
[]
[]
[]
[]
[]
[]
["Actueel jaar",null,{"$f":"'# Onderlinge'!M1","v":2016},null,"Van",null,"t/m"]
["Jeugd Klasse A",null,"16 t/m 18 jr",null,{"$f":"C100-18","v":1998},null,{"$f":"C100-16","v":2000}]
["Jeugd Klasse B",null,"13 t/m 15 jr",null,{"$f":"C100-15","v":2001},null,{"$f":"C100-13","v":2003}]
["Jeugd Klasse C",null,"t/m 12 jr",null,{"$f":"C100-12","v":2004},null,{"$f":"C100","v":2016}]

{"sheet":"Heideroosje","index":7,"n_rows":103,"n_cols":23,"rows_kept":103,"cut":false,"hidden":false,"merged":[[27,18,27,19],[28,18,28,19],[25,18,25,19],[26,18,26,19],[21,18,21,19],[22,18,22,19],[23,18,23,19],[24,18,24,19],[1,4,1,9],[1,10,1,14],[18,18,18,19],[19,18,19,19],[20,18,20,19],[99,0,99,1],[99,2,99,3],[99,4,99,5],[99,6,99,7],[100,0,100,1],[100,2,100,3],[100,4,100,5],[100,6,100,7],[101,0,101,1],[101,2,101,3],[101,4,101,5],[101,6,101,7],[102,0,102,1],[102,2,102,3],[102,4,102,5],[102,6,102,7]]}
[null,"Heideroosje"]
[null,null,null,null,"Hoogste serie",null,null,null,null,null,"Laatste pijlen*"]
["Positie","Naam","Klasse","Punten","1","2","3","4","5","Totaal","21","22","23","24","25","Totaal2","Club",null,"Klasse"]
[1,"Edwin Joosten",1,233,10,10,10,10,10,{"$f":"SUM(ScoresHeideroosje[[#This Row],[1]:[5]])","v":50},10,9,8,9,9,{"$f":"SUM(ScoresHeideroosje[[#This Row],[21]:[25]])","v":45},5,null,1,"Heren"]
[2,"Ben Koper",1,229,9,10,9,9,10,{"$f":"SUM(ScoresHeideroosje[[#This Row],[1]:[5]])","v":47},9,10,9,9,10,{"$f":"SUM(ScoresHeideroosje[[#This Row],[21]:[25]])","v":47},5,null,2,"Dames"]
[3,"Peter Verstappen",3,223,9,9,10,10,9,{"$f":"SUM(ScoresHeideroosje[[#This Row],[1]:[5]])","v":47},9,10,9,9,8,{"$f":"SUM(ScoresHeideroosje[[#This Row],[21]:[25]])","v":45},5,null,3,"Veteraan",null,"Van","t/m"]
[4,"Jo Peeters",3,222,9,10,10,10,9,{"$f":"SUM(ScoresHeideroosje[[#This Row],[1]:[5]])","v":48},9,8,10,10,10,{"$f":"SUM(ScoresHeideroosje[[#This Row],[21]:[25]])","v":47},5,null,4,"Jeugd t/m 18","Groep A",{"$f":"E101","v":1998},{"$f":"G101","v":2000}]
[5,"Maikel Boumans",1,218,9,8,9,10,10,{"$f":"SUM(ScoresHeideroosje[[#This Row],[1]:[5]])","v":46},9,9,10,9,9,{"$f":"SUM(ScoresHeideroosje[[#This Row],[21]:[25]])","v":46},5,null,5,"Jeugd t/m 15","Groep B",{"$f":"E102","v":2001},{"$f":"G102","v":2003}]
[6,"Marc Simons",1,217,9,8,9,10,9,{"$f":"SUM(ScoresHeideroosje[[#This Row],[1]:[5]])","v":45},9,8,9,10,9,{"$f":"SUM(ScoresHeideroosje[[#This Row],[21]:[25]])","v":45},5]
[7,"Math Crins",1,216,10,10,10,8,8,{"$f":"SUM(ScoresHeideroosje[[#This Row],[1]:[5]])","v":46},9,9,9,9,8,{"$f":"SUM(ScoresHeideroosje[[#This Row],[21]:[25]])","v":44},5]
[8,"Marcel Walschot",1,215,10,9,9,9,9,{"$f":"SUM(ScoresHeideroosje[[#This Row],[1]:[5]])","v":46},8,8,8,7,10,{"$f":"SUM(ScoresHeideroosje[[#This Row],[21]:[25]])","v":41},5,null,"Laatste pijlen"]
[9,"Cor Joosten",1,215,10,8,10,9,10,{"$f":"SUM(ScoresHeideroosje[[#This Row],[1]:[5]])","v":47},6,8,8,10,8,{"$f":"SUM(ScoresHeideroosje[[#This Row],[21]:[25]])","v":40},5,null,"Optioneel veld om automatisch sorteren mogelijk te maken"]
[10,"Michael Simons",1,215,10,10,8,10,6,{"$f":"SUM(ScoresHeideroosje[[#This Row],[1]:[5]])","v":44},10,9,9,6,8,{"$f":"SUM(ScoresHeideroosje[[#This Row],[21]:[25]])","v":42},5,null,"Invullen zover nodig"]
[11,"Huub Sijbers",1,212,10,9,9,7,9,{"$f":"SUM(ScoresHeideroosje[[#This Row],[1]:[5]])","v":44},10,9,9,7,9,{"$f":"SUM(ScoresHeideroosje[[#This Row],[21]:[25]])","v":44},5]
[12,"Jan Derks",3,212,10,9,10,9,8,{"$f":"SUM(ScoresHeideroosje[[#This Row],[1]:[5]])","v":46},10,9,10,9,8,{"$f":"SUM(ScoresHeideroosje[[#This Row],[21]:[25]])","v":46},5,null,"Uitslag maken"]
[13,"Mike Sijbers",5,208,10,8,7,10,9,{"$f":"SUM(ScoresHeideroosje[[#This Row],[1]:[5]])","v":44},9,1,6,10,7,{"$f":"SUM(ScoresHeideroosje[[#This Row],[21]:[25]])","v":33},5,null,"Gebruik de knop 'Maak Uitslag' in het uitslagen tabblad om alle"]
[14,"Olga Sijbers",5,208,10,9,9,8,8,{"$f":"SUM(ScoresHeideroosje[[#This Row],[1]:[5]])","v":44},7,10,7,8,7,{"$f":"SUM(ScoresHeideroosje[[#This Row],[21]:[25]])","v":39},5,null,"tabbladen (incl. deze dus) te sorteren en een uitslag te maken"]
[15,"Ria Walschot",2,202,7,7,9,10,8,{"$f":"SUM(ScoresHeideroosje[[#This Row],[1]:[5]])","v":41},7,8,9,8,9,{"$f":"SUM(ScoresHeideroosje[[#This Row],[21]:[25]])","v":41},5]
[16,"Wim Janssen",3,202,9,9,10,8,8,{"$f":"SUM(ScoresHeideroosje[[#This Row],[1]:[5]])","v":44},10,6,10,10,7,{"$f":"SUM(ScoresHeideroosje[[#This Row],[21]:[25]])","v":43},5,null,"Team",null,"Punten"]
[17,"Fred Janssen",1,202,8,7,10,9,10,{"$f":"SUM(ScoresHeideroosje[[#This Row],[1]:[5]])","v":44},10,7,6,7,3,{"$f":"SUM(ScoresHeideroosje[[#This Row],[21]:[25]])","v":33},5,null,{"$f":"CONCATENATE($B$1,\" 1\")","v":"Heideroosje 1"},null,{"$f":"SUM(D4:D9)","v":1342}]
[18,"Brianne Ghielen",5,200,10,9,9,9,9,{"$f":"SUM(ScoresHeideroosje[[#This Row],[1]:[5]])","v":46},7,6,7,8,5,{"$f":"SUM(ScoresHeideroosje[[#This Row],[21]:[25]])","v":33},5,null,{"$f":"CONCATENATE($B$1,\" 2\")","v":"Heideroosje 2"},null,{"$f":"SUM(D10:D15)","v":1285}]
[19,"Hans Sijbers",1,198,8,9,6,10,9,{"$f":"SUM(ScoresHeideroosje[[#This Row],[1]:[5]])","v":42},8,9,6,10,9,{"$f":"SUM(ScoresHeideroosje[[#This Row],[21]:[25]])","v":42},5,null,{"$f":"CONCATENATE($B$1,\" 3\")","v":"Heideroosje 3"},null,{"$f":"SUM(D16:D21)","v":1222}]
[20,"Jan Ottenheim",3,196,10,7,8,10,8,{"$f":"SUM(ScoresHeideroosje[[#This Row],[1]:[5]])","v":43},5,8,8,4,8,{"$f":"SUM(ScoresHeideroosje[[#This Row],[21]:[25]])","v":33},5,null,{"$f":"CONCATENATE($B$1,\" 4\")","v":"Heideroosje 4"},null,{"$f":"SUM(D22:D27)","v":1161}]
[21,"Maurice Linders",1,195,7,10,8,8,9,{"$f":"SUM(ScoresHeideroosje[[#This Row],[1]:[5]])","v":42},9,8,6,9,8,{"$f":"SUM(ScoresHeideroosje[[#This Row],[21]:[25]])","v":40},5,null,{"$f":"CONCATENATE($B$1,\" 5\")","v":"Heideroosje 5"},null,{"$f":"SUM(D28:D33)","v":942}]
[22,"Petra Joosten",2,192,7,10,9,9,8,{"$f":"SUM(ScoresHeideroosje[[#This Row],[1]:[5]])","v":43},7,8,8,9,9,{"$f":"SUM(ScoresHeideroosje[[#This Row],[21]:[25]])","v":41},5,null,{"$f":"CONCATENATE($B$1,\" 6\")","v":"Heideroosje 6"},null,{"$f":"SUM(D34:D39)","v":246}]
[23,"Huub Korsten",1,192,9,9,10,7,10,{"$f":"SUM(ScoresHeideroosje[[#This Row],[1]:[5]])","v":45},9,9,7,7,9,{"$f":"SUM(ScoresHeideroosje[[#This Row],[21]:[25]])","v":41},5,null,{"$f":"CONCATENATE($B$1,\" 7\")","v":"Heideroosje 7"},null,{"$f":"SUM(D40:D45)","v":0}]
[24,"Harry Moonen",1,188,9,9,8,7,7,{"$f":"SUM(ScoresHeideroosje[[#This Row],[1]:[5]])","v":40},9,8,8,7,7,{"$f":"SUM(ScoresHeideroosje[[#This Row],[21]:[25]])","v":39},5,null,{"$f":"CONCATENATE($B$1,\" 8\")","v":"Heideroosje 8"},null,{"$f":"SUM(D46:D51)","v":0}]
[25,"Diana Sijbers",2,180,6,7,9,8,9,{"$f":"SUM(ScoresHeideroosje[[#This Row],[1]:[5]])","v":39},5,8,8,9,7,{"$f":"SUM(ScoresHeideroosje[[#This Row],[21]:[25]])","v":37},5,null,{"$f":"CONCATENATE($B$1,\" 9\")","v":"Heideroosje 9"},null,{"$f":"SUM(D52:D57)","v":0}]
[26,"Fried Fijten",3,173,4,8,7,8,10,{"$f":"SUM(ScoresHeideroosje[[#This Row],[1]:[5]])","v":37},4,8,7,8,10,{"$f":"SUM(ScoresHeideroosje[[#This Row],[21]:[25]])","v":37},5,null,{"$f":"CONCATENATE($B$1,\" 10\")","v":"Heideroosje 10"},null,{"$f":"SUM(D58:D63)","v":0}]
[27,"Carolien van Dijk",2,156,7,9,6,8,6,{"$f":"SUM(ScoresHeideroosje[[#This Row],[1]:[5]])","v":36},8,5,4,5,9,{"$f":"SUM(ScoresHeideroosje[[#This Row],[21]:[25]])","v":31},5]
[28,"Jose Korsten",2,156,7,7,6,10,8,{"$f":"SUM(ScoresHeideroosje[[#This Row],[1]:[5]])","v":38},7,7,8,5,5,{"$f":"SUM(ScoresHeideroosje[[#This Row],[21]:[25]])","v":32},5]
[29,"Thei Peeters",3,142,7,9,8,8,8,{"$f":"SUM(ScoresHeideroosje[[#This Row],[1]:[5]])","v":40},7,9,8,8,8,{"$f":"SUM(ScoresHeideroosje[[#This Row],[21]:[25]])","v":40},5]
[30,"Myrthe Das",5,135,8,7,7,7,6,{"$f":"SUM(ScoresHeideroosje[[#This Row],[1]:[5]])","v":35},7,5,6,5,8,{"$f":"SUM(ScoresHeideroosje[[#This Row],[21]:[25]])","v":31},5]
[31,"Fabienne v/d Dungen",5,131,9,9,7,5,7,{"$f":"SUM(ScoresHeideroosje[[#This Row],[1]:[5]])","v":37},5,5,4,3,9,{"$f":"SUM(ScoresHeideroosje[[#This Row],[21]:[25]])","v":26},5]
[32,"Mike Koper",1,115,4,7,7,5,4,{"$f":"SUM(ScoresHeideroosje[[#This Row],[1]:[5]])","v":27},4,7,7,5,4,{"$f":"SUM(ScoresHeideroosje[[#This Row],[21]:[25]])","v":27},5]
[33,"Rian Jeurninck",2,null,null,null,null,null,null,{"$f":"SUM(ScoresHeideroosje[[#This Row],[1]:[5]])","v":0},null,null,null,null,null,{"$f":"SUM(ScoresHeideroosje[[#This Row],[21]:[25]])","v":0},5]
[34,"Stephan Ghielen",4,null,null,null,null,null,null,{"$f":"SUM(ScoresHeideroosje[[#This Row],[1]:[5]])","v":0},null,null,null,null,null,{"$f":"SUM(ScoresHeideroosje[[#This Row],[21]:[25]])","v":0},5]
[35,"Silfran Ghielen",1,null,null,null,null,null,null,{"$f":"SUM(ScoresHeideroosje[[#This Row],[1]:[5]])","v":0},null,null,null,null,null,{"$f":"SUM(ScoresHeideroosje[[#This Row],[21]:[25]])","v":0},5]
[36,null,null,null,null,null,null,null,null,{"$f":"SUM(ScoresHeideroosje[[#This Row],[1]:[5]])","v":0},null,null,null,null,null,{"$f":"SUM(ScoresHeideroosje[[#This Row],[21]:[25]])","v":0},5]
[37,null,null,null,null,null,null,null,null,{"$f":"SUM(ScoresHeideroosje[[#This Row],[1]:[5]])","v":0},null,null,null,null,null,{"$f":"SUM(ScoresHeideroosje[[#This Row],[21]:[25]])","v":0},5]
[38,null,null,null,null,null,null,null,null,{"$f":"SUM(ScoresHeideroosje[[#This Row],[1]:[5]])","v":0},null,null,null,null,null,{"$f":"SUM(ScoresHeideroosje[[#This Row],[21]:[25]])","v":0},5]
[39,null,null,null,null,null,null,null,null,{"$f":"SUM(ScoresHeideroosje[[#This Row],[1]:[5]])","v":0},null,null,null,null,null,{"$f":"SUM(ScoresHeideroosje[[#This Row],[21]:[25]])","v":0},5]
[40,null,null,null,null,null,null,null,null,{"$f":"SUM(ScoresHeideroosje[[#This Row],[1]:[5]])","v":0},null,null,null,null,null,{"$f":"SUM(ScoresHeideroosje[[#This Row],[21]:[25]])","v":0},5]
[41,null,null,null,null,null,null,null,null,{"$f":"SUM(ScoresHeideroosje[[#This Row],[1]:[5]])","v":0},null,null,null,null,null,{"$f":"SUM(ScoresHeideroosje[[#This Row],[21]:[25]])","v":0},5]
[42,null,null,null,null,null,null,null,null,{"$f":"SUM(ScoresHeideroosje[[#This Row],[1]:[5]])","v":0},null,null,null,null,null,{"$f":"SUM(ScoresHeideroosje[[#This Row],[21]:[25]])","v":0},5]
[43,null,null,null,null,null,null,null,null,{"$f":"SUM(ScoresHeideroosje[[#This Row],[1]:[5]])","v":0},null,null,null,null,null,{"$f":"SUM(ScoresHeideroosje[[#This Row],[21]:[25]])","v":0},5]
[44,null,null,null,null,null,null,null,null,{"$f":"SUM(ScoresHeideroosje[[#This Row],[1]:[5]])","v":0},null,null,null,null,null,{"$f":"SUM(ScoresHeideroosje[[#This Row],[21]:[25]])","v":0},5]
[45,null,null,null,null,null,null,null,null,{"$f":"SUM(ScoresHeideroosje[[#This Row],[1]:[5]])","v":0},null,null,null,null,null,{"$f":"SUM(ScoresHeideroosje[[#This Row],[21]:[25]])","v":0},5]
[46,null,null,null,null,null,null,null,null,{"$f":"SUM(ScoresHeideroosje[[#This Row],[1]:[5]])","v":0},null,null,null,null,null,{"$f":"SUM(ScoresHeideroosje[[#This Row],[21]:[25]])","v":0},5]
[47,null,null,null,null,null,null,null,null,{"$f":"SUM(ScoresHeideroosje[[#This Row],[1]:[5]])","v":0},null,null,null,null,null,{"$f":"SUM(ScoresHeideroosje[[#This Row],[21]:[25]])","v":0},5]
[48,null,null,null,null,null,null,null,null,{"$f":"SUM(ScoresHeideroosje[[#This Row],[1]:[5]])","v":0},null,null,null,null,null,{"$f":"SUM(ScoresHeideroosje[[#This Row],[21]:[25]])","v":0},5]
[49,null,null,null,null,null,null,null,null,{"$f":"SUM(ScoresHeideroosje[[#This Row],[1]:[5]])","v":0},null,null,null,null,null,{"$f":"SUM(ScoresHeideroosje[[#This Row],[21]:[25]])","v":0},5]
[50,null,null,null,null,null,null,null,null,{"$f":"SUM(ScoresHeideroosje[[#This Row],[1]:[5]])","v":0},null,null,null,null,null,{"$f":"SUM(ScoresHeideroosje[[#This Row],[21]:[25]])","v":0},5]
[51,null,null,null,null,null,null,null,null,{"$f":"SUM(ScoresHeideroosje[[#This Row],[1]:[5]])","v":0},null,null,null,null,null,{"$f":"SUM(ScoresHeideroosje[[#This Row],[21]:[25]])","v":0},5]
[52,null,null,null,null,null,null,null,null,{"$f":"SUM(ScoresHeideroosje[[#This Row],[1]:[5]])","v":0},null,null,null,null,null,{"$f":"SUM(ScoresHeideroosje[[#This Row],[21]:[25]])","v":0},5]
[53,null,null,null,null,null,null,null,null,{"$f":"SUM(ScoresHeideroosje[[#This Row],[1]:[5]])","v":0},null,null,null,null,null,{"$f":"SUM(ScoresHeideroosje[[#This Row],[21]:[25]])","v":0},5]
[54,null,null,null,null,null,null,null,null,{"$f":"SUM(ScoresHeideroosje[[#This Row],[1]:[5]])","v":0},null,null,null,null,null,{"$f":"SUM(ScoresHeideroosje[[#This Row],[21]:[25]])","v":0},5]
[55,null,null,null,null,null,null,null,null,{"$f":"SUM(ScoresHeideroosje[[#This Row],[1]:[5]])","v":0},null,null,null,null,null,{"$f":"SUM(ScoresHeideroosje[[#This Row],[21]:[25]])","v":0},5]
[56,null,null,null,null,null,null,null,null,{"$f":"SUM(ScoresHeideroosje[[#This Row],[1]:[5]])","v":0},null,null,null,null,null,{"$f":"SUM(ScoresHeideroosje[[#This Row],[21]:[25]])","v":0},5]
[57,null,null,null,null,null,null,null,null,{"$f":"SUM(ScoresHeideroosje[[#This Row],[1]:[5]])","v":0},null,null,null,null,null,{"$f":"SUM(ScoresHeideroosje[[#This Row],[21]:[25]])","v":0},5]
[58,null,null,null,null,null,null,null,null,{"$f":"SUM(ScoresHeideroosje[[#This Row],[1]:[5]])","v":0},null,null,null,null,null,{"$f":"SUM(ScoresHeideroosje[[#This Row],[21]:[25]])","v":0},5]
[59,null,null,null,null,null,null,null,null,{"$f":"SUM(ScoresHeideroosje[[#This Row],[1]:[5]])","v":0},null,null,null,null,null,{"$f":"SUM(ScoresHeideroosje[[#This Row],[21]:[25]])","v":0},5]
[60,null,null,null,null,null,null,null,null,{"$f":"SUM(ScoresHeideroosje[[#This Row],[1]:[5]])","v":0},null,null,null,null,null,{"$f":"SUM(ScoresHeideroosje[[#This Row],[21]:[25]])","v":0},5]
[]
[]
[]
[]
[]
[]
[]
[]
[]
[]
[]
[]
[]
[]
[]
[]
[]
[]
[]
[]
[]
[]
[]
[]
[]
[]
[]
[]
[]
[]
[]
[]
[]
[]
[]
[]
["Actueel jaar",null,{"$f":"'# Onderlinge'!M1","v":2016},null,"Van",null,"t/m"]
["Jeugd Klasse A",null,"16 t/m 18 jr",null,{"$f":"C100-18","v":1998},null,{"$f":"C100-16","v":2000}]
["Jeugd Klasse B",null,"13 t/m 15 jr",null,{"$f":"C100-15","v":2001},null,{"$f":"C100-13","v":2003}]
["Jeugd Klasse C",null,"t/m 12 jr",null,{"$f":"C100-12","v":2004},null,{"$f":"C100","v":2016}]

{"sheet":"18m schutters","index":8,"n_rows":103,"n_cols":21,"rows_kept":103,"cut":false,"hidden":false,"merged":[[1,4,1,9],[1,10,1,14],[99,0,99,1],[99,2,99,3],[99,4,99,5],[99,6,99,7],[102,0,102,1],[102,2,102,3],[102,4,102,5],[102,6,102,7],[100,0,100,1],[100,2,100,3],[100,4,100,5],[100,6,100,7],[101,0,101,1],[101,2,101,3],[101,4,101,5],[101,6,101,7]]}
[null,"18m Schutters"]
[null,null,null,null,"Hoogste serie",null,null,null,null,null,"Laatste pijlen*"]
["Positie","Naam","Klasse","Punten","1","2","3","4","5","Totaal","21","22","23","24","25","Totaal2","Club",null,"Vereniging"]
[1,"Loek Hendriks","N.V.T.",177,7,10,10,8,7,{"$f":"SUM(E4:I4)","v":42},6,5,6,8,4,{"$f":"SUM(Table23[[#This Row],[21]:[25]])","v":29},3,null,1,"Ons Genoegen"]
[2,"Bram Walschot","N.V.T.",173,7,9,9,8,9,{"$f":"SUM(E5:I5)","v":42},5,6,3,7,9,{"$f":"SUM(Table23[[#This Row],[21]:[25]])","v":30},5,null,2,"Buitenlust"]
[3,"Jorn Hendriks","N.V.T.",146,10,4,6,10,6,{"$f":"SUM(E6:I6)","v":36},6,8,8,1,3,{"$f":"SUM(Table23[[#This Row],[21]:[25]])","v":26},3,null,3,"Roos in Bloei"]
[4,null,"N.V.T.",null,null,null,null,null,null,{"$f":"SUM(E7:I7)","v":0},null,null,null,null,null,{"$f":"SUM(Table23[[#This Row],[21]:[25]])","v":0},null,null,4,"Heideboem"]
[5,null,"N.V.T.",null,null,null,null,null,null,{"$f":"SUM(E8:I8)","v":0},null,null,null,null,null,{"$f":"SUM(Table23[[#This Row],[21]:[25]])","v":0},null,null,5,"Heideroosje"]
[6,null,"N.V.T.",null,null,null,null,null,null,{"$f":"SUM(E9:I9)","v":0},null,null,null,null,null,{"$f":"SUM(Table23[[#This Row],[21]:[25]])","v":0}]
[7,null,"N.V.T.",null,null,null,null,null,null,{"$f":"SUM(E10:I10)","v":0},null,null,null,null,null,{"$f":"SUM(Table23[[#This Row],[21]:[25]])","v":0},null,null,null,"Van ","t/m"]
[8,null,"N.V.T.",null,null,null,null,null,null,{"$f":"SUM(E11:I11)","v":0},null,null,null,null,null,{"$f":"SUM(Table23[[#This Row],[21]:[25]])","v":0},null,null,"Groep C",{"$f":"E103","v":2004},{"$f":"G103","v":2016}]
[9,null,"N.V.T.",null,null,null,null,null,null,{"$f":"SUM(E12:I12)","v":0},null,null,null,null,null,{"$f":"SUM(Table23[[#This Row],[21]:[25]])","v":0}]
[10,null,"N.V.T.",null,null,null,null,null,null,{"$f":"SUM(E13:I13)","v":0},null,null,null,null,null,{"$f":"SUM(Table23[[#This Row],[21]:[25]])","v":0}]
[11,null,"N.V.T.",null,null,null,null,null,null,{"$f":"SUM(E14:I14)","v":0},null,null,null,null,null,{"$f":"SUM(Table23[[#This Row],[21]:[25]])","v":0}]
[12,null,"N.V.T.",null,null,null,null,null,null,{"$f":"SUM(E15:I15)","v":0},null,null,null,null,null,{"$f":"SUM(Table23[[#This Row],[21]:[25]])","v":0}]
[13,null,"N.V.T.",null,null,null,null,null,null,{"$f":"SUM(E16:I16)","v":0},null,null,null,null,null,{"$f":"SUM(Table23[[#This Row],[21]:[25]])","v":0}]
[14,null,"N.V.T.",null,null,null,null,null,null,{"$f":"SUM(E17:I17)","v":0},null,null,null,null,null,{"$f":"SUM(Table23[[#This Row],[21]:[25]])","v":0}]
[15,null,"N.V.T.",null,null,null,null,null,null,{"$f":"SUM(E18:I18)","v":0},null,null,null,null,null,{"$f":"SUM(Table23[[#This Row],[21]:[25]])","v":0}]
[]
[]
[]
[]
[]
[]
[]
[]
[]
[]
[]
[]
[]
[]
[]
[]
[]
[]
[]
[]
[]
[]
[]
[]
[]
[]
[]
[]
[]
[]
[]
[]
[]
[]
[]
[]
[]
[]
[]
[]
[]
[]
[]
[]
[]
[]
[]
[]
[]
[]
[]
[]
[]
[]
[]
[]
[]
[]
[]
[]
[]
[]
[]
[]
[]
[]
[]
[]
[]
[]
[]
[]
[]
[]
[]
[]
[]
[]
[]
[]
[]
["Actueel jaar",null,{"$f":"'# Onderlinge'!M1","v":2016},null,"Van",null,"t/m"]
["Jeugd Klasse A",null,"16 t/m 18 jr",null,{"$f":"C100-18","v":1998},null,{"$f":"C100-16","v":2000}]
["Jeugd Klasse B",null,"13 t/m 15 jr",null,{"$f":"C100-15","v":2001},null,{"$f":"C100-13","v":2003}]
["Jeugd Klasse C",null,"t/m 12 jr",null,{"$f":"C100-12","v":2004},null,{"$f":"C100","v":2016}]